{"text_format":"1","workbook":"xlsx","n_sheets":5,"sheets":["Summary","KQ","Area","Area & KQ","Scenario Options"],"not_rendered":{"charts":0,"images":2,"macros":1,"external_links":0,"defined_names":6,"comments":0,"pivot_tables":0},"unopened":[],"bounds":{"document_bytes":16777216,"sheet_cells":100000,"rows_first":2000,"rows_last":500,"rows_between":2000,"halvings":0,"cell_chars":16384,"cell_head_chars":4096},"cells_cut":0,"cells_raw":0,"read":"whole","date_system":"1900"}

{"sheet":"Summary","index":0,"n_rows":32,"n_cols":4,"rows_kept":32,"cut":false,"hidden":false,"merged":[[9,1,9,2]]}
[]
[]
["ORLANDO/ST. CLOUD REGIONAL RESILIENCY CONNECTION"]
["         St. Cloud Central - Magnolia Ranch 230kV Line Option"]
[null,"Customer: ","OUC"]
[null,"Project No: "]
[null,"Description: "]
[null,"Location: ","FL"]
[]
["NO.","DESCRIPTION",null,"Total"]
[]
[1,"St. Cloud Central - Magnolia Ranch 230kV Line (2017 Estimate)",null,57346045.583120406]
[null,"Overhead line"]
[null,"Overhead cost - $37,155,726"]
[null,"Conductor adder - $92,883"]
[null,"Structure adder - $2,672,437"]
[null,"Underground line"]
[null,"Underground cost - $14,300,000"]
[null,"813 MVA, 1272 ACSS/TW"]
[null,"Move spare 230/69kV transformer from South to Central"]
{"$rows_left_out":13}
{"sheet":"KQ","index":1,"n_rows":30,"n_cols":16,"rows_kept":30,"cut":false,"hidden":true,"merged":[]}
[null,"Customer: ",{"$f":"+#REF!","v":{"$error":"#REF!"}},null,null,null,null,"Key Quantity Summary"]
[null,"Project No: ",{"$f":"+#REF!","v":{"$error":"#REF!"}},null,null,null,null,null,null,null,null,"Estimator:",{"$f":"+#REF!","v":{"$error":"#REF!"}}]
[null,"Description: ",{"$f":"+#REF!","v":{"$error":"#REF!"}},null,null,null,null,null,null,null,null,"Date:",{"$f":"+#REF!","v":{"$error":"#REF!"}}]
[null,"Location: ",{"$f":"+#REF!","v":{"$error":"#REF!"}},null,null,null,null,null,null,null,null,"Rev:",{"$f":"+#REF!","v":{"$error":"#REF!"}}]
[]
["NO.","ACCOUNT",null,"Key Qty","Unit","Unit MH","MH\nLabor","Wage Rate","Labor","Unit","Construction Equipment","Unit Matl","Equipment / Materials","Unit Total","Total"]
[]
[1,"Equipment",null,{"$f":"SUMIFS(#REF!,#REF!,$B8,#REF!,$E8)","v":{"$error":"#REF!"}},"PCS-",{"$f":"IF($D8=0,\"--\",G8/$D8)","v":{"$error":"#REF!"}},{"$f":"SUMIFS(#REF!,#REF!,$B8)","v":{"$error":"#REF!"}},{"$f":"+IF(G8=0,\"--\",I8/G8)","v":{"$error":"#REF!"}},{"$f":"SUMIFS(#REF!,#REF!,$B8)","v":{"$error":"#REF!"}},{"$f":"IF($D8=0,\"--\",K8/$D8)","v":{"$error":"#REF!"}},{"$f":"SUMIFS(#REF!,#REF!,$B8)","v":{"$error":"#REF!"}},{"$f":"IF($D8=0,\"--\",M8/$D8)","v":{"$error":"#REF!"}},{"$f":"SUMIFS(#REF!,#REF!,$B8)","v":{"$error":"#REF!"}},{"$f":"IF($D8=0,\"--\",O8/$D8)","v":{"$error":"#REF!"}},{"$f":"SUM(I8,K8,M8)","v":{"$error":"#REF!"}}]
[2,"Civil",null,{"$f":"SUMIFS(#REF!,#REF!,$B9,#REF!,$E9)","v":{"$error":"#REF!"}},null,{"$f":"IF($D9=0,\"--\",G9/$D9)","v":{"$error":"#REF!"}},{"$f":"SUMIFS(#REF!,#REF!,$B9)","v":{"$error":"#REF!"}},{"$f":"+IF(G9=0,\"--\",I9/G9)","v":{"$error":"#REF!"}},{"$f":"SUMIFS(#REF!,#REF!,$B9)","v":{"$error":"#REF!"}},{"$f":"IF($D9=0,\"--\",K9/$D9)","v":{"$error":"#REF!"}},{"$f":"SUMIFS(#REF!,#REF!,$B9)","v":{"$error":"#REF!"}},{"$f":"IF($D9=0,\"--\",M9/$D9)","v":{"$error":"#REF!"}},{"$f":"SUMIFS(#REF!,#REF!,$B9)","v":{"$error":"#REF!"}},{"$f":"IF($D9=0,\"--\",O9/$D9)","v":{"$error":"#REF!"}},{"$f":"SUM(I9,K9,M9)","v":{"$error":"#REF!"}}]
[3,"Deep Foundations",null,{"$f":"SUMIFS(#REF!,#REF!,$B10,#REF!,$E10)","v":{"$error":"#REF!"}},"Piles-",{"$error":"#REF!"},{"$f":"SUMIFS(#REF!,#REF!,$B10)","v":{"$error":"#REF!"}},{"$error":"#REF!"},{"$f":"SUMIFS(#REF!,#REF!,$B10)","v":{"$error":"#REF!"}},{"$error":"#REF!"},{"$f":"SUMIFS(#REF!,#REF!,$B10)","v":{"$error":"#REF!"}},{"$error":"#REF!"},{"$f":"SUMIFS(#REF!,#REF!,$B10)","v":{"$error":"#REF!"}},{"$error":"#REF!"},{"$error":"#REF!"}]
[4,"Concrete",null,{"$f":"SUMIFS(#REF!,#REF!,$B11,#REF!,$E11)","v":{"$error":"#REF!"}},"CY-",{"$error":"#REF!"},{"$f":"SUMIFS(#REF!,#REF!,$B11)","v":{"$error":"#REF!"}},{"$error":"#REF!"},{"$f":"SUMIFS(#REF!,#REF!,$B11)","v":{"$error":"#REF!"}},{"$error":"#REF!"},{"$f":"SUMIFS(#REF!,#REF!,$B11)","v":{"$error":"#REF!"}},{"$error":"#REF!"},{"$f":"SUMIFS(#REF!,#REF!,$B11)","v":{"$error":"#REF!"}},{"$error":"#REF!"},{"$error":"#REF!"}]
[null,"Cementitious Grout",null,{"$f":"SUMIFS(#REF!,#REF!,$B12,#REF!,$E12)","v":{"$error":"#REF!"}},"SF-",{"$error":"#REF!"},{"$f":"SUMIFS(#REF!,#REF!,$B12)","v":{"$error":"#REF!"}},{"$error":"#REF!"},{"$f":"SUMIFS(#REF!,#REF!,$B12)","v":{"$error":"#REF!"}},{"$error":"#REF!"},{"$f":"SUMIFS(#REF!,#REF!,$B12)","v":{"$error":"#REF!"}},{"$error":"#REF!"},{"$f":"SUMIFS(#REF!,#REF!,$B12)","v":{"$error":"#REF!"}},{"$error":"#REF!"},{"$error":"#REF!"}]
[null,"Epoxy Grout",null,{"$f":"SUMIFS(#REF!,#REF!,$B13,#REF!,$E13)","v":{"$error":"#REF!"}},"CF-",{"$error":"#REF!"},{"$f":"SUMIFS(#REF!,#REF!,$B13)","v":{"$error":"#REF!"}},{"$error":"#REF!"},{"$f":"SUMIFS(#REF!,#REF!,$B13)","v":{"$error":"#REF!"}},{"$error":"#REF!"},{"$f":"SUMIFS(#REF!,#REF!,$B13)","v":{"$error":"#REF!"}},{"$error":"#REF!"},{"$f":"SUMIFS(#REF!,#REF!,$B13)","v":{"$error":"#REF!"}},{"$error":"#REF!"},{"$error":"#REF!"}]
[5,"Steel",null,{"$f":"SUMIFS(#REF!,#REF!,$B14,#REF!,$E14)","v":{"$error":"#REF!"}},"TON-",{"$error":"#REF!"},{"$f":"SUMIFS(#REF!,#REF!,$B14)","v":{"$error":"#REF!"}},{"$error":"#REF!"},{"$f":"SUMIFS(#REF!,#REF!,$B14)","v":{"$error":"#REF!"}},{"$error":"#REF!"},{"$f":"SUMIFS(#REF!,#REF!,$B14)","v":{"$error":"#REF!"}},{"$error":"#REF!"},{"$f":"SUMIFS(#REF!,#REF!,$B14)","v":{"$error":"#REF!"}},{"$error":"#REF!"},{"$error":"#REF!"}]
[6,"Buildings",null,{"$f":"SUMIFS(#REF!,#REF!,$B15,#REF!,$E15)","v":{"$error":"#REF!"}},"SF-",{"$error":"#REF!"},{"$f":"SUMIFS(#REF!,#REF!,$B15)","v":{"$error":"#REF!"}},{"$error":"#REF!"},{"$f":"SUMIFS(#REF!,#REF!,$B15)","v":{"$error":"#REF!"}},{"$error":"#REF!"},{"$f":"SUMIFS(#REF!,#REF!,$B15)","v":{"$error":"#REF!"}},{"$error":"#REF!"},{"$f":"SUMIFS(#REF!,#REF!,$B15)","v":{"$error":"#REF!"}},{"$error":"#REF!"},{"$error":"#REF!"}]
[7,"Pipe",null,{"$f":"SUMIFS(#REF!,#REF!,$B16,#REF!,$E16)","v":{"$error":"#REF!"}},"LF-",{"$error":"#REF!"},{"$f":"SUMIFS(#REF!,#REF!,$B16)","v":{"$error":"#REF!"}},{"$error":"#REF!"},{"$f":"SUMIFS(#REF!,#REF!,$B16)","v":{"$error":"#REF!"}},{"$error":"#REF!"},{"$f":"SUMIFS(#REF!,#REF!,$B16)","v":{"$error":"#REF!"}},{"$error":"#REF!"},{"$f":"SUMIFS(#REF!,#REF!,$B16)","v":{"$error":"#REF!"}},{"$error":"#REF!"},{"$error":"#REF!"}]
[8,"Electrical",null,{"$f":"SUMIFS(#REF!,#REF!,$B17,#REF!,$E17)","v":{"$error":"#REF!"}},"LF-",{"$error":"#REF!"},{"$f":"SUMIFS(#REF!,#REF!,$B17)","v":{"$error":"#REF!"}},{"$error":"#REF!"},{"$f":"SUMIFS(#REF!,#REF!,$B17)","v":{"$error":"#REF!"}},{"$error":"#REF!"},{"$f":"SUMIFS(#REF!,#REF!,$B17)","v":{"$error":"#REF!"}},{"$error":"#REF!"},{"$f":"SUMIFS(#REF!,#REF!,$B17)","v":{"$error":"#REF!"}},{"$error":"#REF!"},{"$error":"#REF!"}]
[9,"Instrument & Control",null,{"$f":"SUMIFS(#REF!,#REF!,$B18,#REF!,$E18)","v":{"$error":"#REF!"}},"EA-",{"$error":"#REF!"},{"$f":"SUMIFS(#REF!,#REF!,$B18)","v":{"$error":"#REF!"}},{"$error":"#REF!"},{"$f":"SUMIFS(#REF!,#REF!,$B18)","v":{"$error":"#REF!"}},{"$error":"#REF!"},{"$f":"SUMIFS(#REF!,#REF!,$B18)","v":{"$error":"#REF!"}},{"$error":"#REF!"},{"$f":"SUMIFS(#REF!,#REF!,$B18)","v":{"$error":"#REF!"}},{"$error":"#REF!"},{"$error":"#REF!"}]
[10,"Piping Insulation",null,{"$f":"SUMIFS(#REF!,#REF!,$B19,#REF!,$E19)","v":{"$error":"#REF!"}},"LF-",{"$error":"#REF!"},{"$f":"SUMIFS(#REF!,#REF!,$B19)","v":{"$error":"#REF!"}},{"$error":"#REF!"},{"$f":"SUMIFS(#REF!,#REF!,$B19)","v":{"$error":"#REF!"}},{"$error":"#REF!"},{"$f":"SUMIFS(#REF!,#REF!,$B19)","v":{"$error":"#REF!"}},{"$error":"#REF!"},{"$f":"SUMIFS(#REF!,#REF!,$B19)","v":{"$error":"#REF!"}},{"$error":"#REF!"},{"$error":"#REF!"}]
[null,"Equipment Insulation",null,{"$f":"SUMIFS(#REF!,#REF!,$B20,#REF!,$E20)","v":{"$error":"#REF!"}},"SF-",{"$error":"#REF!"},{"$f":"SUMIFS(#REF!,#REF!,$B20)","v":{"$error":"#REF!"}},{"$error":"#REF!"},{"$f":"SUMIFS(#REF!,#REF!,$B20)","v":{"$error":"#REF!"}},{"$error":"#REF!"},{"$f":"SUMIFS(#REF!,#REF!,$B20)","v":{"$error":"#REF!"}},{"$error":"#REF!"},{"$f":"SUMIFS(#REF!,#REF!,$B20)","v":{"$error":"#REF!"}},{"$error":"#REF!"},{"$error":"#REF!"}]
{"$rows_left_out":11}
{"sheet":"Area","index":2,"n_rows":25,"n_cols":10,"rows_kept":25,"cut":false,"hidden":true,"merged":[]}
[null,"Customer: ",{"$f":"+#REF!","v":{"$error":"#REF!"}},null,null,"Area 1 Summary"]
[null,"Project No: ",{"$f":"+#REF!","v":{"$error":"#REF!"}},null,null,null,null,"Estimator:",{"$f":"+#REF!","v":{"$error":"#REF!"}}]
[null,"Description: ",{"$f":"+#REF!","v":{"$error":"#REF!"}},null,null,null,null,"Date:",{"$f":"+#REF!","v":{"$error":"#REF!"}}]
[null,"Location: ",{"$f":"+#REF!","v":{"$error":"#REF!"}},null,null,null,null,"Rev:",{"$f":"+#REF!","v":{"$error":"#REF!"}}]
[]
["NO.","ACCOUNT",null,"MH\nLabor","Wage Rate","Labor","Construction Equipment","Equipment / Materials","Total"]
[]
[null,"Area 1",null,{"$f":"SUMIFS(#REF!,#REF!,$B8)","v":{"$error":"#REF!"}},{"$f":"+IF(D8=0,\"--\",F8/D8)","v":{"$error":"#REF!"}},{"$f":"SUMIFS(#REF!,#REF!,$B8)","v":{"$error":"#REF!"}},{"$f":"SUMIFS(#REF!,#REF!,$B8)","v":{"$error":"#REF!"}},{"$f":"SUMIFS(#REF!,#REF!,$B8)","v":{"$error":"#REF!"}},{"$f":"SUM(F8,G8,H8)","v":{"$error":"#REF!"}},{"$f":"ROUND(SUMIFS(#REF!,#REF!,$B8)-I8, 0)","v":{"$error":"#REF!"}}]
[null,"Area 2",null,{"$f":"SUMIFS(#REF!,#REF!,$B9)","v":{"$error":"#REF!"}},{"$f":"+IF(D9=0,\"--\",F9/D9)","v":{"$error":"#REF!"}},{"$f":"SUMIFS(#REF!,#REF!,$B9)","v":{"$error":"#REF!"}},{"$f":"SUMIFS(#REF!,#REF!,$B9)","v":{"$error":"#REF!"}},{"$f":"SUMIFS(#REF!,#REF!,$B9)","v":{"$error":"#REF!"}},{"$f":"SUM(F9,G9,H9)","v":{"$error":"#REF!"}},{"$f":"ROUND(SUMIFS(#REF!,#REF!,$B9)-I9, 0)","v":{"$error":"#REF!"}}]
[null,"Area 3",null,{"$f":"SUMIFS(#REF!,#REF!,$B10)","v":{"$error":"#REF!"}},{"$error":"#REF!"},{"$f":"SUMIFS(#REF!,#REF!,$B10)","v":{"$error":"#REF!"}},{"$f":"SUMIFS(#REF!,#REF!,$B10)","v":{"$error":"#REF!"}},{"$f":"SUMIFS(#REF!,#REF!,$B10)","v":{"$error":"#REF!"}},{"$error":"#REF!"},{"$f":"ROUND(SUMIFS(#REF!,#REF!,$B10)-I10, 0)","v":{"$error":"#REF!"}}]
[null,"Area 4",null,{"$f":"SUMIFS(#REF!,#REF!,$B11)","v":{"$error":"#REF!"}},{"$error":"#REF!"},{"$f":"SUMIFS(#REF!,#REF!,$B11)","v":{"$error":"#REF!"}},{"$f":"SUMIFS(#REF!,#REF!,$B11)","v":{"$error":"#REF!"}},{"$f":"SUMIFS(#REF!,#REF!,$B11)","v":{"$error":"#REF!"}},{"$error":"#REF!"},{"$f":"ROUND(SUMIFS(#REF!,#REF!,$B11)-I11, 0)","v":{"$error":"#REF!"}}]
[null,"Area 5",null,{"$f":"SUMIFS(#REF!,#REF!,$B12)","v":{"$error":"#REF!"}},{"$error":"#REF!"},{"$f":"SUMIFS(#REF!,#REF!,$B12)","v":{"$error":"#REF!"}},{"$f":"SUMIFS(#REF!,#REF!,$B12)","v":{"$error":"#REF!"}},{"$f":"SUMIFS(#REF!,#REF!,$B12)","v":{"$error":"#REF!"}},{"$error":"#REF!"},{"$f":"ROUND(SUMIFS(#REF!,#REF!,$B12)-I12, 0)","v":{"$error":"#REF!"}}]
[null,"Area 6",null,{"$f":"SUMIFS(#REF!,#REF!,$B13)","v":{"$error":"#REF!"}},{"$error":"#REF!"},{"$f":"SUMIFS(#REF!,#REF!,$B13)","v":{"$error":"#REF!"}},{"$f":"SUMIFS(#REF!,#REF!,$B13)","v":{"$error":"#REF!"}},{"$f":"SUMIFS(#REF!,#REF!,$B13)","v":{"$error":"#REF!"}},{"$error":"#REF!"},{"$f":"ROUND(SUMIFS(#REF!,#REF!,$B13)-I13, 0)","v":{"$error":"#REF!"}}]
[null,"Area 7",null,{"$f":"SUMIFS(#REF!,#REF!,$B14)","v":{"$error":"#REF!"}},{"$error":"#REF!"},{"$f":"SUMIFS(#REF!,#REF!,$B14)","v":{"$error":"#REF!"}},{"$f":"SUMIFS(#REF!,#REF!,$B14)","v":{"$error":"#REF!"}},{"$f":"SUMIFS(#REF!,#REF!,$B14)","v":{"$error":"#REF!"}},{"$error":"#REF!"},{"$f":"ROUND(SUMIFS(#REF!,#REF!,$B14)-I14, 0)","v":{"$error":"#REF!"}}]
[null,"Area 8",null,{"$f":"SUMIFS(#REF!,#REF!,$B15)","v":{"$error":"#REF!"}},{"$error":"#REF!"},{"$f":"SUMIFS(#REF!,#REF!,$B15)","v":{"$error":"#REF!"}},{"$f":"SUMIFS(#REF!,#REF!,$B15)","v":{"$error":"#REF!"}},{"$f":"SUMIFS(#REF!,#REF!,$B15)","v":{"$error":"#REF!"}},{"$error":"#REF!"},{"$f":"ROUND(SUMIFS(#REF!,#REF!,$B15)-I15, 0)","v":{"$error":"#REF!"}}]
[null,"Area 9",null,{"$f":"SUMIFS(#REF!,#REF!,$B16)","v":{"$error":"#REF!"}},{"$error":"#REF!"},{"$f":"SUMIFS(#REF!,#REF!,$B16)","v":{"$error":"#REF!"}},{"$f":"SUMIFS(#REF!,#REF!,$B16)","v":{"$error":"#REF!"}},{"$f":"SUMIFS(#REF!,#REF!,$B16)","v":{"$error":"#REF!"}},{"$error":"#REF!"},{"$f":"ROUND(SUMIFS(#REF!,#REF!,$B16)-I16, 0)","v":{"$error":"#REF!"}}]
[null,"Area 10",null,{"$f":"SUMIFS(#REF!,#REF!,$B17)","v":{"$error":"#REF!"}},{"$error":"#REF!"},{"$f":"SUMIFS(#REF!,#REF!,$B17)","v":{"$error":"#REF!"}},{"$f":"SUMIFS(#REF!,#REF!,$B17)","v":{"$error":"#REF!"}},{"$f":"SUMIFS(#REF!,#REF!,$B17)","v":{"$error":"#REF!"}},{"$error":"#REF!"},{"$f":"ROUND(SUMIFS(#REF!,#REF!,$B17)-I17, 0)","v":{"$error":"#REF!"}}]
[null,"Area 11",null,{"$f":"SUMIFS(#REF!,#REF!,$B18)","v":{"$error":"#REF!"}},{"$error":"#REF!"},{"$f":"SUMIFS(#REF!,#REF!,$B18)","v":{"$error":"#REF!"}},{"$f":"SUMIFS(#REF!,#REF!,$B18)","v":{"$error":"#REF!"}},{"$f":"SUMIFS(#REF!,#REF!,$B18)","v":{"$error":"#REF!"}},{"$error":"#REF!"},{"$f":"ROUND(SUMIFS(#REF!,#REF!,$B18)-I18, 0)","v":{"$error":"#REF!"}}]
[null,"Area 12",null,{"$f":"SUMIFS(#REF!,#REF!,$B19)","v":{"$error":"#REF!"}},{"$error":"#REF!"},{"$f":"SUMIFS(#REF!,#REF!,$B19)","v":{"$error":"#REF!"}},{"$f":"SUMIFS(#REF!,#REF!,$B19)","v":{"$error":"#REF!"}},{"$f":"SUMIFS(#REF!,#REF!,$B19)","v":{"$error":"#REF!"}},{"$error":"#REF!"},{"$f":"ROUND(SUMIFS(#REF!,#REF!,$B19)-I19, 0)","v":{"$error":"#REF!"}}]
[null,"Area 13",null,{"$f":"SUMIFS(#REF!,#REF!,$B20)","v":{"$error":"#REF!"}},{"$error":"#REF!"},{"$f":"SUMIFS(#REF!,#REF!,$B20)","v":{"$error":"#REF!"}},{"$f":"SUMIFS(#REF!,#REF!,$B20)","v":{"$error":"#REF!"}},{"$f":"SUMIFS(#REF!,#REF!,$B20)","v":{"$error":"#REF!"}},{"$error":"#REF!"},{"$f":"ROUND(SUMIFS(#REF!,#REF!,$B20)-I20, 0)","v":{"$error":"#REF!"}}]
{"$rows_left_out":6}
{"sheet":"Area & KQ","index":3,"n_rows":30,"n_cols":17,"rows_kept":30,"cut":false,"hidden":true,"merged":[]}
[null,"Customer: ",{"$f":"+#REF!","v":{"$error":"#REF!"}},null,null,null,null,{"$f":"+Q1&\" Key Quantity Summary\"","v":"Area 1 Key Quantity Summary"},null,null,null,null,null,null,null,null,"Area 1"]
[null,"Project No: ",{"$f":"+#REF!","v":{"$error":"#REF!"}},null,null,null,null,null,null,null,null,"Estimator:",{"$f":"+#REF!","v":{"$error":"#REF!"}}]
[null,"Description: ",{"$f":"+#REF!","v":{"$error":"#REF!"}},null,null,null,null,null,null,null,null,"Date:",{"$f":"+#REF!","v":{"$error":"#REF!"}}]
[null,"Location: ",{"$f":"+#REF!","v":{"$error":"#REF!"}},null,null,null,null,null,null,null,null,"Rev:",{"$f":"+#REF!","v":{"$error":"#REF!"}}]
[]
["NO.","ACCOUNT",null,"Key Qty","Unit","Unit MH","MH\nLabor","Wage Rate","Labor","Unit","Construction Equipment","Unit Matl","Equipment / Materials","Unit Total","Total"]
[]
[1,"Equipment",null,{"$f":"SUMIFS(#REF!,#REF!,$B8,#REF!,$E8,#REF!,$Q$1)","v":{"$error":"#REF!"}},"PCS-",{"$f":"IF($D8=0,\"--\",G8/$D8)","v":{"$error":"#REF!"}},{"$f":"SUMIFS(#REF!,#REF!,$B8,#REF!,$Q$1)","v":{"$error":"#REF!"}},{"$f":"+IF(G8=0,\"--\",I8/G8)","v":{"$error":"#REF!"}},{"$f":"SUMIFS(#REF!,#REF!,$B8,#REF!,$Q$1)","v":{"$error":"#REF!"}},{"$f":"IF($D8=0,\"--\",K8/$D8)","v":{"$error":"#REF!"}},{"$f":"SUMIFS(#REF!,#REF!,$B8,#REF!,$Q$1)","v":{"$error":"#REF!"}},{"$f":"IF($D8=0,\"--\",M8/$D8)","v":{"$error":"#REF!"}},{"$f":"SUMIFS(#REF!,#REF!,$B8,#REF!,$Q$1)","v":{"$error":"#REF!"}},{"$f":"IF($D8=0,\"--\",O8/$D8)","v":{"$error":"#REF!"}},{"$f":"SUM(I8,K8,M8)","v":{"$error":"#REF!"}}]
[2,"Civil",null,{"$f":"SUMIFS(#REF!,#REF!,$B9,#REF!,$E9)","v":{"$error":"#REF!"}},null,{"$f":"IF($D9=0,\"--\",G9/$D9)","v":{"$error":"#REF!"}},{"$f":"SUMIFS(#REF!,#REF!,$B9,#REF!,$Q$1)","v":{"$error":"#REF!"}},{"$f":"+IF(G9=0,\"--\",I9/G9)","v":{"$error":"#REF!"}},{"$f":"SUMIFS(#REF!,#REF!,$B9,#REF!,$Q$1)","v":{"$error":"#REF!"}},{"$f":"IF($D9=0,\"--\",K9/$D9)","v":{"$error":"#REF!"}},{"$f":"SUMIFS(#REF!,#REF!,$B9,#REF!,$Q$1)","v":{"$error":"#REF!"}},{"$f":"IF($D9=0,\"--\",M9/$D9)","v":{"$error":"#REF!"}},{"$f":"SUMIFS(#REF!,#REF!,$B9,#REF!,$Q$1)","v":{"$error":"#REF!"}},{"$f":"IF($D9=0,\"--\",O9/$D9)","v":{"$error":"#REF!"}},{"$f":"SUM(I9,K9,M9)","v":{"$error":"#REF!"}}]
[3,"Deep Foundations",null,{"$f":"SUMIFS(#REF!,#REF!,$B10,#REF!,$E10)","v":{"$error":"#REF!"}},"Piles-",{"$error":"#REF!"},{"$f":"SUMIFS(#REF!,#REF!,$B10,#REF!,$Q$1)","v":{"$error":"#REF!"}},{"$error":"#REF!"},{"$f":"SUMIFS(#REF!,#REF!,$B10,#REF!,$Q$1)","v":{"$error":"#REF!"}},{"$error":"#REF!"},{"$f":"SUMIFS(#REF!,#REF!,$B10,#REF!,$Q$1)","v":{"$error":"#REF!"}},{"$error":"#REF!"},{"$f":"SUMIFS(#REF!,#REF!,$B10,#REF!,$Q$1)","v":{"$error":"#REF!"}},{"$error":"#REF!"},{"$error":"#REF!"}]
[4,"Concrete",null,{"$f":"SUMIFS(#REF!,#REF!,$B11,#REF!,$E11)","v":{"$error":"#REF!"}},"CY-",{"$error":"#REF!"},{"$f":"SUMIFS(#REF!,#REF!,$B11,#REF!,$Q$1)","v":{"$error":"#REF!"}},{"$error":"#REF!"},{"$f":"SUMIFS(#REF!,#REF!,$B11,#REF!,$Q$1)","v":{"$error":"#REF!"}},{"$error":"#REF!"},{"$f":"SUMIFS(#REF!,#REF!,$B11,#REF!,$Q$1)","v":{"$error":"#REF!"}},{"$error":"#REF!"},{"$f":"SUMIFS(#REF!,#REF!,$B11,#REF!,$Q$1)","v":{"$error":"#REF!"}},{"$error":"#REF!"},{"$error":"#REF!"}]
[null,"Cementitious Grout",null,{"$f":"SUMIFS(#REF!,#REF!,$B12,#REF!,$E12)","v":{"$error":"#REF!"}},"SF-",{"$error":"#REF!"},{"$f":"SUMIFS(#REF!,#REF!,$B12,#REF!,$Q$1)","v":{"$error":"#REF!"}},{"$error":"#REF!"},{"$f":"SUMIFS(#REF!,#REF!,$B12,#REF!,$Q$1)","v":{"$error":"#REF!"}},{"$error":"#REF!"},{"$f":"SUMIFS(#REF!,#REF!,$B12,#REF!,$Q$1)","v":{"$error":"#REF!"}},{"$error":"#REF!"},{"$f":"SUMIFS(#REF!,#REF!,$B12,#REF!,$Q$1)","v":{"$error":"#REF!"}},{"$error":"#REF!"},{"$error":"#REF!"}]
[null,"Epoxy Grout",null,{"$f":"SUMIFS(#REF!,#REF!,$B13,#REF!,$E13)","v":{"$error":"#REF!"}},"CF-",{"$error":"#REF!"},{"$f":"SUMIFS(#REF!,#REF!,$B13,#REF!,$Q$1)","v":{"$error":"#REF!"}},{"$error":"#REF!"},{"$f":"SUMIFS(#REF!,#REF!,$B13,#REF!,$Q$1)","v":{"$error":"#REF!"}},{"$error":"#REF!"},{"$f":"SUMIFS(#REF!,#REF!,$B13,#REF!,$Q$1)","v":{"$error":"#REF!"}},{"$error":"#REF!"},{"$f":"SUMIFS(#REF!,#REF!,$B13,#REF!,$Q$1)","v":{"$error":"#REF!"}},{"$error":"#REF!"},{"$error":"#REF!"}]
[5,"Steel",null,{"$f":"SUMIFS(#REF!,#REF!,$B14,#REF!,$E14)","v":{"$error":"#REF!"}},"TON-",{"$error":"#REF!"},{"$f":"SUMIFS(#REF!,#REF!,$B14,#REF!,$Q$1)","v":{"$error":"#REF!"}},{"$error":"#REF!"},{"$f":"SUMIFS(#REF!,#REF!,$B14,#REF!,$Q$1)","v":{"$error":"#REF!"}},{"$error":"#REF!"},{"$f":"SUMIFS(#REF!,#REF!,$B14,#REF!,$Q$1)","v":{"$error":"#REF!"}},{"$error":"#REF!"},{"$f":"SUMIFS(#REF!,#REF!,$B14,#REF!,$Q$1)","v":{"$error":"#REF!"}},{"$error":"#REF!"},{"$error":"#REF!"}]
[6,"Buildings",null,{"$f":"SUMIFS(#REF!,#REF!,$B15,#REF!,$E15)","v":{"$error":"#REF!"}},"SF-",{"$error":"#REF!"},{"$f":"SUMIFS(#REF!,#REF!,$B15,#REF!,$Q$1)","v":{"$error":"#REF!"}},{"$error":"#REF!"},{"$f":"SUMIFS(#REF!,#REF!,$B15,#REF!,$Q$1)","v":{"$error":"#REF!"}},{"$error":"#REF!"},{"$f":"SUMIFS(#REF!,#REF!,$B15,#REF!,$Q$1)","v":{"$error":"#REF!"}},{"$error":"#REF!"},{"$f":"SUMIFS(#REF!,#REF!,$B15,#REF!,$Q$1)","v":{"$error":"#REF!"}},{"$error":"#REF!"},{"$error":"#REF!"}]
[7,"Pipe",null,{"$f":"SUMIFS(#REF!,#REF!,$B16,#REF!,$E16)","v":{"$error":"#REF!"}},"LF-",{"$error":"#REF!"},{"$f":"SUMIFS(#REF!,#REF!,$B16,#REF!,$Q$1)","v":{"$error":"#REF!"}},{"$error":"#REF!"},{"$f":"SUMIFS(#REF!,#REF!,$B16,#REF!,$Q$1)","v":{"$error":"#REF!"}},{"$error":"#REF!"},{"$f":"SUMIFS(#REF!,#REF!,$B16,#REF!,$Q$1)","v":{"$error":"#REF!"}},{"$error":"#REF!"},{"$f":"SUMIFS(#REF!,#REF!,$B16,#REF!,$Q$1)","v":{"$error":"#REF!"}},{"$error":"#REF!"},{"$error":"#REF!"}]
[8,"Electrical",null,{"$f":"SUMIFS(#REF!,#REF!,$B17,#REF!,$E17)","v":{"$error":"#REF!"}},"LF-",{"$error":"#REF!"},{"$f":"SUMIFS(#REF!,#REF!,$B17,#REF!,$Q$1)","v":{"$error":"#REF!"}},{"$error":"#REF!"},{"$f":"SUMIFS(#REF!,#REF!,$B17,#REF!,$Q$1)","v":{"$error":"#REF!"}},{"$error":"#REF!"},{"$f":"SUMIFS(#REF!,#REF!,$B17,#REF!,$Q$1)","v":{"$error":"#REF!"}},{"$error":"#REF!"},{"$f":"SUMIFS(#REF!,#REF!,$B17,#REF!,$Q$1)","v":{"$error":"#REF!"}},{"$error":"#REF!"},{"$error":"#REF!"}]
[9,"Instrument & Control",null,{"$f":"SUMIFS(#REF!,#REF!,$B18,#REF!,$E18)","v":{"$error":"#REF!"}},"EA-",{"$error":"#REF!"},{"$f":"SUMIFS(#REF!,#REF!,$B18,#REF!,$Q$1)","v":{"$error":"#REF!"}},{"$error":"#REF!"},{"$f":"SUMIFS(#REF!,#REF!,$B18,#REF!,$Q$1)","v":{"$error":"#REF!"}},{"$error":"#REF!"},{"$f":"SUMIFS(#REF!,#REF!,$B18,#REF!,$Q$1)","v":{"$error":"#REF!"}},{"$error":"#REF!"},{"$f":"SUMIFS(#REF!,#REF!,$B18,#REF!,$Q$1)","v":{"$error":"#REF!"}},{"$error":"#REF!"},{"$error":"#REF!"}]
[10,"Piping Insulation",null,{"$f":"SUMIFS(#REF!,#REF!,$B19,#REF!,$E19)","v":{"$error":"#REF!"}},"LF-",{"$error":"#REF!"},{"$f":"SUMIFS(#REF!,#REF!,$B19,#REF!,$Q$1)","v":{"$error":"#REF!"}},{"$error":"#REF!"},{"$f":"SUMIFS(#REF!,#REF!,$B19,#REF!,$Q$1)","v":{"$error":"#REF!"}},{"$error":"#REF!"},{"$f":"SUMIFS(#REF!,#REF!,$B19,#REF!,$Q$1)","v":{"$error":"#REF!"}},{"$error":"#REF!"},{"$f":"SUMIFS(#REF!,#REF!,$B19,#REF!,$Q$1)","v":{"$error":"#REF!"}},{"$error":"#REF!"},{"$error":"#REF!"}]
[null,"Equipment Insulation",null,{"$f":"SUMIFS(#REF!,#REF!,$B20,#REF!,$E20)","v":{"$error":"#REF!"}},"SF-",{"$error":"#REF!"},{"$f":"SUMIFS(#REF!,#REF!,$B20,#REF!,$Q$1)","v":{"$error":"#REF!"}},{"$error":"#REF!"},{"$f":"SUMIFS(#REF!,#REF!,$B20,#REF!,$Q$1)","v":{"$error":"#REF!"}},{"$error":"#REF!"},{"$f":"SUMIFS(#REF!,#REF!,$B20,#REF!,$Q$1)","v":{"$error":"#REF!"}},{"$error":"#REF!"},{"$f":"SUMIFS(#REF!,#REF!,$B20,#REF!,$Q$1)","v":{"$error":"#REF!"}},{"$error":"#REF!"},{"$error":"#REF!"}]
{"$rows_left_out":11}
{"sheet":"Scenario Options","index":4,"n_rows":296,"n_cols":29,"rows_kept":296,"cut":false,"hidden":true,"merged":[[0,25,0,28],[0,5,0,8],[0,9,0,12],[0,13,0,16],[0,17,0,20],[0,21,0,24]]}
[null,null,null,null,null,"Scenario 1",null,null,null,"Scenario 2",null,null,null,"Scenario 3",null,null,null,"Scenario 4",null,null,null,"Scenario 5",null,null,null,"Scenario 6"]
[null,null,null,null,null,"T1","T4","T5","Total","T1","T4","T5","Total","T1","T4","T5","Total","T1","T4","T5","Total","T1","T4","T5","Total","T1","T4","T5","Total"]
["69kV Conductor & Hardware Only",null,null,null,null,null,1.17,null,{"$f":"SUM(F3:H3)","v":1.17}]
["69kV S/C",null,null,null,null,null,1.92,1.1399999999999999,3.0599999999999996,null,null,null,null,null,2.27,0.65]
["230kV S/C",null,null,null,null,2.6,null,0.33,2.93,null,null,null,null,2.6]
["230kV/69 DC (69kV Vacant)",null,null,null,null,null,null,1.17,1.17]
["230/69kV DC",null,null,null,null,null,null,null,null,2.6,null,1.6,null,null,null,0.65,null,null,2.0499999999999998,{"$f":"1.38+1.16","v":2.54},null,0,2.0499999999999998,{"$f":"0.73+0.71+(2*(0.44))","v":2.3199999999999998},null,1,2.3199999999999998,{"$f":"(2*1.15)+(2*1.15)","v":4.5999999999999996}]
[]
["DESCRIPTION",null,"QTY","UNIT","UM"]
[]
["Site Work"]
[" ",null,null," ",null,null,null,null,{"$f":"SUM(F12:H12)","v":0},null,null,null,{"$f":"SUM(J12:L12)","v":0},null,null,null,{"$f":"SUM(N12:P12)","v":0},null,null,null,{"$f":"SUM(R12:T12)","v":0},null,null,null,{"$f":"SUM(V12:X12)","v":0},null,null,null,{"$f":"SUM(Z12:AB12)","v":0}]
["ROW Clearing & Grubbing",null,{"$f":"(1)*5280*100/43560","v":12.121212121212121},"acre",null,{"$f":"SUM(F4:F7)*5280*30/43560*0.1","v":0.94545454545454555},{"$f":"SUM(G4:G7)*5280*30/43560*0.1","v":0.69818181818181824},0.95999999999999985,{"$f":"SUM(F13:H13)","v":2.6036363636363635},{"$f":"SUM(J4:J7)*5280*30/43560*0.1","v":0.94545454545454555},{"$f":"SUM(K4:K7)*5280*30/43560*0.1","v":0},0.5818181818181819,{"$f":"SUM(J13:L13)","v":1.5272727272727273},{"$f":"SUM(N4:N7)*5280*30/43560*0.1","v":0.94545454545454555},{"$f":"SUM(O4:O7)*5280*30/43560*0.1","v":0.82545454545454544},0.47272727272727277,{"$f":"SUM(N13:P13)","v":2.2436363636363637},{"$f":"SUM(R4:R7)*5280*30/43560*0.1","v":0},{"$f":"SUM(S4:S7)*5280*30/43560*0.1","v":0.74545454545454537},0.9236363636363637,{"$f":"SUM(R13:T13)","v":1.669090909090909},{"$f":"SUM(V4:V7)*5280*30/43560*0.1","v":0},{"$f":"SUM(W4:W7)*5280*30/43560*0.1","v":0.74545454545454537},0.84363636363636363,{"$f":"SUM(V13:X13)","v":1.5890909090909089},{"$f":"SUM(Z4:Z7)*5280*30/43560*0.1","v":0.36363636363636365},{"$f":"SUM(AA4:AA7)*5280*30/43560*0.1","v":0.84363636363636363},1.6727272727272724,{"$f":"SUM(Z13:AB13)","v":2.88}]
["Cut/Fill new yard addition (92,408SF/27+3423CY)",null,null,"CY",0.2,null,null,null,0,null,null,null,0,null,null,null,0,null,null,null,0,null,null,null,0,null,null,null,0]
["Silt Fence (Install , Maintain, and Remove)",null,{"$f":"SUM(C67:C101)*100","v":9800},"LF",0.15,{"$f":"200*SUM(F67:F101)","v":4200},{"$f":"200*SUM(G67:G101)","v":3200},4600,12000,{"$f":"200*SUM(J67:J101)","v":4400},{"$f":"200*SUM(K67:K101)","v":0},2800,7200,{"$f":"200*SUM(N67:N101)","v":4200},{"$f":"200*SUM(O67:O101)","v":3800},2200,10200,{"$f":"200*SUM(R67:R101)","v":0},{"$f":"200*SUM(S67:S101)","v":3600},4400,8000,{"$f":"200*SUM(V67:V101)","v":0},{"$f":"200*SUM(W67:W101)","v":3600},4000,7600,{"$f":"200*SUM(Z67:Z101)","v":1800},{"$f":"200*SUM(AA67:AA101)","v":4000},7800,13600]
[" "," ",null,null,null,null,null,null,0,null,null,null,0,null,null,null,0,null,null,null,0,null,null,null,0,null,null,null,0]
[" "," ",null,null,null,null,null,null,0,null,null,null,0,null,null,null,0,null,null,null,0,null,null,null,0,null,null,null,0]
[" "," ",null,null,null,null,null,null,0,null,null,null,0,null,null,null,0,null,null,null,0,null,null,null,0,null,null,null,0]
[" "," ",null,null,null,null,null,null,0,null,null,null,0,null,null,null,0,null,null,null,0,null,null,null,0,null,null,null,0]
[" "," ",null,null,null,null,null,null,0,null,null,null,0,null,null,null,0,null,null,null,0,null,null,null,0,null,null,null,0]
{"$rows_left_out":276}