{"text_format":"1","workbook":"xlsx","n_sheets":14,"sheets":["Sign Off","A - Contractor Summary","A.1 SEE Members","B - Summary Expenses ","C.1 - Rate Sheets","C.2 - Timesheets - Labor","C.3 - Asset by Company","C.4 - Timesheets - Equipment","D - Lodging","E - Fuel","F - Meals","I - Other","G - Per Diem","H - Mileage"],"not_rendered":{"charts":0,"images":0,"macros":1,"external_links":3,"defined_names":9,"comments":0,"pivot_tables":0},"unopened":[],"bounds":{"document_bytes":16777216,"sheet_cells":100000,"rows_first":2000,"rows_last":500,"rows_between":2000,"halvings":0,"cell_chars":16384,"cell_head_chars":4096},"cells_cut":0,"cells_raw":0,"read":"whole","date_system":"1900"}

{"sheet":"Sign Off","index":0,"n_rows":19,"n_cols":5,"rows_kept":19,"cut":false,"hidden":false,"merged":[[1,1,1,4],[3,1,3,4],[10,1,10,4],[15,1,15,4]]}
[]
[null,"Sign Off's"]
[]
[null,"Accounting"]
[]
[null,null,"Name","Title","Date"]
[null,"Preparer","Belen Villalba","Temp Analyst","2019-12-11"]
[null,"Reviewer","William Adams","Financial Analysis Manager","2020-01-14"]
[null,"Approver","N/A","N/A","N/A"]
[]
[null,"Audit Services"]
[]
[null,null,"Name","Title","Date"]
[null,"Preparer"]
[]
[null,"Energy Delivery"]
[]
[null,null,"Name","Title","Date"]
[null,"Final Reviewer"]

{"sheet":"A - Contractor Summary","index":1,"n_rows":61,"n_cols":10,"rows_kept":61,"cut":false,"hidden":false,"merged":[[1,1,1,3],[3,1,12,3],[22,6,26,6],[22,9,26,9]]}
[]
[null,"Contractor Summary"]
[]
[null,"Test Plan: (A) Using the drop down list, select the vendor.  (B) Ensure address agrees to invoice(s). (C) Enter the distance between vendor address to Plant City, FL.  (D) Determine if vendor is part of the SEE (see tab A.1 for listing). (E) Determine if other agreements exist.  (F) Using the drop down list, select the Incident Base that the vendor was initially assigned.  (G) If the contractor includes multiple crews with different timelines, utilize the '+' symbol at the top of columns 'H' and 'K' (if necessary) to unhide the vendor summary.  (H) Click the button to populate the second (and third, if necessary) set of tabs for documentation of those expenses.  (I) Complete steps (A) through (F)."]
[]
[]
[]
[]
[]
[]
[]
[]
[]
[null,null,null,null,null,"G",null,null,"G"]
[null,null,"Cew #01",null,null,"Crew#02",null,null,"Vendor #3"]
[]
[null,null,null,null,null,null,"H",null,null,"H"]
[]
[null,"Contractor/Company","ABC PROFESSIONAL TREE SERVICES INC","A",null,"ABC PROFESSIONAL TREE SERVICES INC","A",null,null,"A"]
[null,"SAP Vendor#",null,null,null,null,null,null,{"$f":"VLOOKUP(I19,#REF!,2,FALSE)","v":{"$error":"#REF!"}}]
[null,"Service Type","Distribution",null,null,null,null,null,{"$f":"VLOOKUP($I$19,#REF!,4,FALSE)","v":{"$error":"#REF!"}}]
[]
[null,"Address","201 Flint Ridge Rd, Suite 201","B",null,null,"B",null,{"$f":"VLOOKUP($I$19,#REF!,13,FALSE)","v":{"$error":"#REF!"}},"B"]
[null,"City","Webster",null,null,null,null,null,{"$f":"VLOOKUP($I$19,#REF!,14,FALSE)","v":{"$error":"#REF!"}}]
[null,"State/Providence","TX",null,null,null,null,null,{"$f":"VLOOKUP($I$19,#REF!,15,FALSE)","v":{"$error":"#REF!"}}]
[null,"Zip",null,null,null,null,null,null,{"$f":"VLOOKUP($I$19,#REF!,16,FALSE)","v":{"$error":"#REF!"}}]
[null,"Country","US",null,null,"US",null,null,{"$f":"VLOOKUP($I$19,#REF!,17,FALSE)","v":{"$error":"#REF!"}}]
[]
[null,"Distance from FL (in miles)",{"$f":"478+180","v":658},"C",null,{"$f":"328+337","v":665},"C",null,800,"C"]
[null,"Travel Days (500 m/per day)",1,null,null,1,null,null,{"$f":"ROUNDUP(I29/500,0)","v":2}]
[]
[null,"Member of the SEE",null,"D",null,null,"D",null,"NO","D"]
[null,"Other Agreement/Contract (Y/N)",null,"E",null,null,"E",null,"NO","E"]
[null,"Incident Base",null,"F",null,null,"F",null,"Winter Haven ","F"]
[]
[null,"Date Secured","10/21/18-10/31/18",null,null,"10/21/18-10/31/18",null,null,{"$f":"VLOOKUP($I$19,#REF!,6,FALSE)","v":{"$error":"#REF!"}}]
[null,"Start Travel","Nashville, AK",null,null,"Southhaven, MS",null,null,{"$f":"VLOOKUP($I$19,#REF!,7,FALSE)","v":{"$error":"#REF!"}}]
[null,"Date Arrived","2018-10-21",null,null,"2018-10-21",null,null,{"$f":"VLOOKUP($I$19,#REF!,8,FALSE)","v":{"$error":"#REF!"}}]
[null,"Date Released","2018-10-31",null,null,"2018-10-31",null,null,{"$f":"VLOOKUP($I$19,#REF!,9,FALSE)","v":{"$error":"#REF!"}}]
[null,"Time Released",null,null,null,null,null,null,{"$f":"VLOOKUP($I$19,#REF!,10,FALSE)","v":{"$error":"#REF!"}}]
[null,"Released To","Dayton, TX",null,null,"Southhaven, MS",null,null,{"$f":"VLOOKUP($I$19,#REF!,11,FALSE)","v":{"$error":"#REF!"}}]
[null,"Arrived Home/Utility*","2018-10-31",null,null,"2018-10-31",null,null,{"$f":"IF(I41=\"home\",SUM(IF(I29>500,I39+I30,I39)),I39)","v":{"$error":"#REF!"}}]
[]
[]
[]
[]
[null,null,null,null,null,"C.1 - Rate Sheets (2)",null,null,"C.1 - Rate Sheets (3)"]
[null,null,null,null,null,"C.2 - Timesheets - Labor (2)",null,null,"C.2 - Timesheets - Labor (3)"]
[null,null,null,null,null,"C.4 - Timesheets - Equipmen (2)",null,null,"C.4 - Timesheets - Equipmen (3)"]
[null,null,null,null,null,"D - Lodging (2)",null,null,"D - Lodging (3)"]
[null,null,null,null,null,"E - Fuel (2)",null,null,"E - Fuel (3)"]
[null,null,null,null,null,"F - Meals (2)",null,null,"F - Meals (3)"]
[null,null,null,null,null,"G - Per Diem (2)",null,null,"G - Per Diem (3)"]
[null,null,null,null,null,"H - Mileage (2)",null,null,"H - Mileage (3)"]
[null,null,null,null,null,"I - Other (2)",null,null,"I - Other (3)"]
[]
[]
[]
[null,"*Estimates reasonable arrival time"]
[]
[null,"Tickmark Explanation: "]

{"sheet":"A.1 SEE Members","index":2,"n_rows":65,"n_cols":3,"rows_kept":65,"cut":false,"hidden":false,"merged":[]}
["RMAG","RESPONDING COMPANY","COMPANY NAME"]
["SEE"]
["SEE"]
["SEE"]
["SEE"]
["SEE"]
["SEE"]
["SEE"]
["SEE"]
["SEE"]
["SEE"]
["SEE"]
["SEE"]
["SEE"]
["SEE"]
["SEE"]
["SEE"]
["SEE"]
["SEE"]
[]
[]
[]
[]
["SEE"]
["SEE"]
["SEE"]
["SEE"]
["SEE"]
["SEE"]
[]
["SEE"]
["SEE"]
["SEE"]
["SEE"]
["SEE"]
[]
[]
[]
[]
["SEE"]
["SEE"]
["SEE"]
["SEE"]
[]
[]
[]
["SEE"]
[]
[]
[]
[]
[]
[]
[]
["SEE"]
["SEE"]
["SEE"]
[]
[]
[]
["SEE"]
[]
[]
["SEE"]
["SEE"]

{"sheet":"B - Summary Expenses ","index":3,"n_rows":65,"n_cols":8,"rows_kept":65,"cut":false,"hidden":false,"merged":[[1,1,1,7],[3,1,6,7],[30,1,30,4],[31,1,31,4]]}
[]
[null,"Summary of Expenses"]
[]
[null,"Test Plan: (A) Calculate Total Amount Invoiced for each expense category. (B) Using SAP t-code FBL1N, list Vendor Invoices Paid.  (C) Ensure there are no differences between the Total Expense Amount and the Total Paid Amount. (D) Ensure there are no difference between Total Invoiced Amount and Total Expense Amount.  (E) If applicable, identify difference due to Foreign currency exchange rates.  "]
[]
[]
[]
[]
[null,null,"A"]
[null,null,"Total Invoiced","Total Calculated","Allowable","Reviewed - Allowed","Reviewed - Not Allowable","Not Allowable"]
[null,"Labor Expense Total",262771.86,{"$f":"'C.2 - Timesheets - Labor'!AL67","v":262771.85999999993},{"$f":"'C.2 - Timesheets - Labor'!AM67","v":262771.85999999993},{"$f":"'C.2 - Timesheets - Labor'!AP67","v":0},{"$f":"'C.2 - Timesheets - Labor'!AQ67","v":0},{"$f":"D11-(E11+F11+G11)","v":0}]
[null,"Equipment Expense Total",60241.26,{"$f":"'C.4 - Timesheets - Equipment'!AA64","v":60241.259999999987},{"$f":"'C.4 - Timesheets - Equipment'!AB64","v":60241.259999999987},{"$f":"'C.4 - Timesheets - Equipment'!AD64","v":0},{"$f":"'C.4 - Timesheets - Equipment'!AE64","v":0},{"$f":"D12-(E12+F12+G12)","v":0}]
[null,"Lodging Expense Total",null,{"$f":"'D - Lodging'!L93","v":0},{"$f":"'D - Lodging'!T93","v":0},{"$f":"'D - Lodging'!V93","v":0},{"$f":"'D - Lodging'!W93","v":0},{"$f":"D13-(E13+F13+G13)","v":0}]
[null,"Fuel/Transport Expense Total",null,{"$f":"'E - Fuel'!J34","v":0},{"$f":"'E - Fuel'!Q34","v":0},{"$f":"'E - Fuel'!S34","v":0},{"$f":"'E - Fuel'!T34","v":0},0]
[null,"Meal Expense Total",null,{"$f":"'F - Meals'!K141","v":0},{"$f":"'F - Meals'!R141","v":0},{"$f":"'F - Meals'!T141","v":0},{"$f":"'F - Meals'!U141","v":0},0]
[null,"Per Diem Expense Total",9797.4,{"$f":"'G - Per Diem'!I39","v":9797.4000000000015},{"$f":"'G - Per Diem'!N39","v":0},{"$f":"'G - Per Diem'!P39","v":9797.4000000000015},{"$f":"'G - Per Diem'!Q39","v":0},0]
[null,"Mileage Expense Total",null,{"$f":"'H - Mileage'!L36","v":0},{"$f":"'H - Mileage'!R36","v":0},{"$f":"'H - Mileage'!T36","v":0},{"$f":"'H - Mileage'!U36","v":0},0]
[null,"Other Expense",null,{"$f":"'I - Other'!K16","v":0},{"$f":"'I - Other'!R16","v":0},{"$f":"'I - Other'!T16","v":0},{"$f":"'I - Other'!U16","v":0},{"$f":"D18-(E18+F18+G18)","v":0}]
[]
[null,"Total Expense per tabs",{"$f":"SUM(C11:C18)","v":332810.52},{"$f":"SUM(D11:D18)","v":332810.51999999996},{"$f":"SUM(E11:E18)","v":323013.11999999994},{"$f":"SUM(F11:F18)","v":9797.4000000000015},{"$f":"SUM(G11:G18)","v":0},0]
[null,"Difference",{"$f":"IF(D21=0,\"\",\"1\")","v":""},{"$f":"C20-D20","v":0},"D"]
[]
[null,"Total Expense ",null,{"$f":"+D20","v":332810.51999999996}," (from Total SAP Summary)"]
[null,"Total Paid",null,{"$f":"-D60","v":-332810.52},"(from FBL1N in SAP)"]
[null,"Difference",{"$f":"IF(D25=0,\"\",SUM(C21,1))","v":""},{"$f":"+D23+D24","v":0},"C"," "]
[]
[null,"Exchange Rate"]
[null,"Fx Adjusted to USD",null,null," "]
[null,"Difference",{"$f":"IF(D29=0,\"\",\"3\")","v":""},null,"E"]
[]
[null,"B"]
[]
[null,"Document No ","Doc Date ","Amount","Reference"]
[null,362473,"2018-11-01",64269.100000000006,676928,null,null," "]
[null,362494,"2018-11-01",70082.5,676931]
[null,362569,"2018-11-08",93089.27,676930]
[null,362735,"2018-11-08",105369.65000000002,676932]
[]
[]
[]
[]
[]
[]
[]
[]
[]
[]
[]
[]
[]
[]
[]
[]
[]
[]
[]
[]
[]
[]
[null,null,null,{"$f":"SUM(D34:D59)","v":332810.52}]
[]
[null,"Tickmark Explanation:"]
[null,{"$f":"IFERROR(C21,\"\")","v":""}]
[]
[null,{"$f":"IFERROR(C25,\"\")","v":""}]

{"sheet":"C.1 - Rate Sheets","index":4,"n_rows":63,"n_cols":19,"rows_kept":63,"cut":false,"hidden":false,"merged":[[12,1,12,5],[12,7,12,8],[3,1,3,8],[62,6,62,8],[1,1,1,8]]}
[]
[null,"Labor Charges - Rate Sheet"]
[]
[null,"Test Plan: (A) Using the vendor rate sheet, ensure that a rate was provided for all Positions and Equipment types.  "]
[]
[null,"Labor Types:"]
[null,"ST","Straight Time"]
[null,"OT","Over Time"]
[null,"DT","Double Time"]
[null,"MOB/DMOB","Mobilization/Demobilization Time"]
[]
[]
[null,"Labor per Man Hour",null,null,null,null," ","Labor per Equipment Hour"]
[null,"A",null,null,null,null,null,"A"]
[null,"POSITION","ST","OT","DT","MOB/DMOB",null,"Type","$/HOUR"]
[null,"General Foreman",null,129.41,172.54,null,null,"Pick-Up",28.75,1]
[null,"Foreman",null,114.8,153.06,null,null,"Mobilization on Equipment (1 ton or less)",2.09]
[null,"Crew Member",null,83.28,null,null,null,"Mobilization on Equipment (More than 1 ton)",2.78]
[null,"Crew Member (other)",null,102.27,136.36000000000001,null,null,"55' Lift",44.28]
[null,"Per Diem per person",null,172.5,null,null,null,"60/70' Bucket ",63.25]
[null,"Per Diem per person",null,33.33]
[]
[]
[null,null,null,null,null,null,null,null,null,null,null,null,null,null,null,null,null,null," "]
[]
[]
[]
[]
[]
[]
[]
[]
[]
[]
[]
[]
[]
[]
[]
[]
[]
[]
[]
[]
[]
[]
[]
[]
[]
[]
[]
[]
[]
[]
[]
[]
[]
[]
[]
[]
[]
[null,"Tickmark Explanation:"]
[null,1]

{"sheet":"C.2 - Timesheets - Labor","index":5,"n_rows":80,"n_cols":45,"rows_kept":80,"cut":false,"hidden":false,"merged":[[14,39,17,39],[14,28,14,32],[15,34,17,34],[15,33,17,33],[66,1,66,5],[14,1,17,1],[14,2,17,2],[14,4,17,4],[14,5,17,5],[14,3,17,3],[14,8,17,8],[14,10,16,13],[14,9,17,9],[15,28,17,28],[67,21,67,24],[67,26,67,27],[14,6,17,6],[14,7,17,7],[67,14,67,17],[67,28,67,31],[3,2,7,13],[1,1,1,43],[14,41,17,41],[14,42,17,42],[14,43,17,43],[15,32,17,32],[15,31,17,31],[15,30,17,30],[15,29,17,29],[14,38,17,38],[14,40,17,40],[14,33,14,37],[15,37,17,37],[15,36,17,36],[15,35,17,35]]}
[]
[null,"Labor Charges - Time Card"]
[]
[null,"Test Plan:","Obtain the time cards.  (A) Using the Asset by Company tab (C.3), populate the crew members names and positions (if provided).  Find additional information regarding individual crew member from related invoice.  (B) Enter hours worked from time card(s). (C) Confirm that the dates per the time cards fall between dates provided per 'A - Contractor Summary' tab. (D) Confirm the labor type charged agrees to the rate sheet. (E) Identify any labor charges to be reviewed (manually enter amounts based on reasonability of time period labor was charged, discrepancies between timecards and invoice, etc.  (F) For charges which required further review, document review (include why it was determined to be allowed/disallowed via a tickmark)."]
[]
[]
[]
[]
[]
[null,"Rx","Recalculated."]
[null,"a","Provided from tab 'C.1 - Rate Sheets'."]
[null,"b","Check figure should equal $0.  Cell will appear yellow if discrepancies are noted."]
[]
[null,null,"A ",null,null,null,null,"Rx",null,"C","a",null,null,null,null,null,null,null,null,null,null,null,null,null,null,null,null,null,null,null,null,null,null,"Rx",null,null,null,null,"Rx",null,"E","F"]
[null,"#","Name","Position","Company","Crew#","Invoice#","Start Date","End Date","Dates Worked Reasonable?","Rates",null,null,null,"2018-10-21","2018-10-22","2018-10-23","2018-10-24","2018-10-25","2018-10-26","2018-10-27","2018-10-28","2018-10-29","10/302018","2018-10-31","2018-11-01","2018-11-02","2018-11-03","Total Labor Hours",null,null,null,null,"Total Labor $",null,null,null,null,"Allowable Charges","Labor Type Appropriate?","To Be Reviewed","Reviewed - Allowable Charge","Reviewed - Unallowable Charge","Tickmarks"]
[null,null,null,null,null,null,null,null,null,null,null,null,null,null,"2018-10-21","2018-10-22","2018-10-23","2018-10-24","2018-10-25","2018-10-26","2018-10-27","2018-10-28","2018-10-29","2018-10-30","2018-10-31","2018-11-01","2018-11-02","2018-11-03","ST","OT","DT","MOB/DMOB","Total Hours","Total ST $","Total OT $","Total DT $","Total MOB/DMOB $","Total Labor $"]
[null,null,null,null,null,null,null,null,null,null,null,null,null,null,"Sunday","Monday","Tuesday","Wednesday","Thursday","Friday","Saturday","Sunday","Monday","Tuesday","Wednesday","Thursday","Friday","Saturday"]
[null,null,null,null,null,null,null,null,null,null,"ST","OT","DT","MOB/DMOB","Total ","Total","Total","Total","Total","Total","Total","Total ","Total","Total","Total","Total","Total","Total"]
[null,1,"Luis Arredondo","General Foreman","Vendor No.01","Crew#1",362473,"2018-10-21","2018-10-27",{"$f":"IF(AND(H19>='A - Contractor Summary'!$C$36,I19<='A - Contractor Summary'!$C$42),\"Yes\",\"No\")","v":"No"},0,129.41,0,{"$f":"VLOOKUP($D19,'C.1 - Rate Sheets'!B:F,5,FALSE)","v":0},{"$f":"46/7","v":6.5714285714285712},{"$f":"46/7","v":6.5714285714285712},6.5714285714285712,6.5714285714285712,6.5714285714285712,6.5714285714285712,6.5714285714285712,null,null,null,null,null,null,null,null,{"$f":"SUM(O19:AC19)","v":45.999999999999993},null,null,{"$f":"SUM(AC19:AF19)","v":45.999999999999993},{"$f":"AC19*K19","v":0},5952.8599999999988,0,0,{"$f":"SUM(AH19:AK19)","v":5952.8599999999988},{"$f":"AL19-AO19","v":5952.8599999999988},"Yes",0,0,0]
[null,2,"Javier Gonzalez","Foreman","Vendor No.01","Crew#1",362473,"2018-10-21","2018-10-27",{"$f":"IF(AND(H20>='A - Contractor Summary'!$C$36,I20<='A - Contractor Summary'!$C$42),\"Yes\",\"No\")","v":"No"},0,114.8,0,{"$f":"VLOOKUP($D20,'C.1 - Rate Sheets'!B:F,5,FALSE)","v":0},{"$f":"46/7","v":6.5714285714285712},6.5714285714285712,6.5714285714285712,6.5714285714285712,6.5714285714285712,6.5714285714285712,6.5714285714285712,null,null,null,null,null,null,null,null,45.999999999999993,null,null,{"$f":"SUM(AC20:AF20)","v":45.999999999999993},0,5280.7999999999993,0,0,{"$f":"SUM(AH20:AK20)","v":5280.7999999999993},5280.7999999999993,"Yes",0,0,0]
[null,3,null,"Crew Member (other)","Vendor No.01","Crew#1",362473,"2018-10-21","2018-10-27",{"$f":"IF(AND(H21>='A - Contractor Summary'!$C$36,I21<='A - Contractor Summary'!$C$42),\"Yes\",\"No\")","v":"No"},0,102.27,0,{"$f":"VLOOKUP($D21,'C.1 - Rate Sheets'!B:F,5,FALSE)","v":0},{"$f":"92/7","v":13.142857142857142},{"$f":"92/7","v":13.142857142857142},13.142857142857142,13.142857142857142,13.142857142857142,13.142857142857142,13.142857142857142,null,null,null,null,null,null,null,null,91.999999999999986,null,null,{"$f":"SUM(AC21:AF21)","v":91.999999999999986},0,9408.8399999999983,0,0,9408.8399999999983,9408.8399999999983,"Yes",0,0,0]
[null,4,"Danny Herrera","Foreman","Vendor No.01","Crew#1",362473,"2018-10-21","2018-10-27",{"$f":"IF(AND(H22>='A - Contractor Summary'!$C$36,I22<='A - Contractor Summary'!$C$42),\"Yes\",\"No\")","v":"No"},0,114.8,0,{"$f":"VLOOKUP($D22,'C.1 - Rate Sheets'!B:F,5,FALSE)","v":0},{"$f":"46/7","v":6.5714285714285712},{"$f":"46/7","v":6.5714285714285712},6.5714285714285712,6.5714285714285712,6.5714285714285712,6.5714285714285712,6.5714285714285712,null,null,null,null,null,null,null,null,45.999999999999993,null,null,45.999999999999993,0,5280.7999999999993,0,0,5280.7999999999993,5280.7999999999993,"Yes",0,0,0]
[null,5,null,"Crew Member","Vendor No.01","Crew#1",362473,"2018-10-21","2018-10-27",{"$f":"IF(AND(H23>='A - Contractor Summary'!$C$36,I23<='A - Contractor Summary'!$C$42),\"Yes\",\"No\")","v":"No"},0,83.28,0,{"$f":"VLOOKUP($D23,'C.1 - Rate Sheets'!B:F,5,FALSE)","v":0},{"$f":"92/7","v":13.142857142857142},{"$f":"92/7","v":13.142857142857142},13.142857142857142,13.142857142857142,13.142857142857142,13.142857142857142,13.142857142857142,null,null,null,null,null,null,null,null,91.999999999999986,null,null,91.999999999999986,0,7661.7599999999993,0,0,7661.7599999999993,7661.7599999999993,"Yes",0,0,0]
[null,6,"Mario Zarco","Foreman","Vendor No.01","Crew#1",362473,"2018-10-21","2018-10-27",{"$f":"IF(AND(H24>='A - Contractor Summary'!$C$36,I24<='A - Contractor Summary'!$C$42),\"Yes\",\"No\")","v":"No"},0,114.8,0,{"$f":"VLOOKUP($D24,'C.1 - Rate Sheets'!B:F,5,FALSE)","v":0},{"$f":"46/7","v":6.5714285714285712},{"$f":"46/7","v":6.5714285714285712},6.5714285714285712,6.5714285714285712,6.5714285714285712,6.5714285714285712,6.5714285714285712,null,null,null,null,null,null,null,null,45.999999999999993,null,null,45.999999999999993,0,5280.7999999999993,0,0,5280.7999999999993,5280.7999999999993,"Yes",0,0,0]
[null,7,null,"Crew Member (other)","Vendor No.01","Crew#1",362473,"2018-10-21","2018-10-27",{"$f":"IF(AND(H25>='A - Contractor Summary'!$C$36,I25<='A - Contractor Summary'!$C$42),\"Yes\",\"No\")","v":"No"},0,102.27,0,{"$f":"VLOOKUP($D25,'C.1 - Rate Sheets'!B:F,5,FALSE)","v":0},{"$f":"46/7","v":6.5714285714285712},6.5714285714285712,6.5714285714285712,6.5714285714285712,6.5714285714285712,6.5714285714285712,6.5714285714285712,null,null,null,null,null,null,null,null,45.999999999999993,null,null,45.999999999999993,0,4704.4199999999992,0,0,4704.4199999999992,4704.4199999999992,"Yes",0,0,0]
[null,8]
[null,9,"A Rodriguez","General Foreman","Vendor No.01","Crew#2",362494,"2018-10-21","2018-10-27",{"$f":"IF(AND(H27>='A - Contractor Summary'!$C$36,I27<='A - Contractor Summary'!$C$42),\"Yes\",\"No\")","v":"No"},0,129.41,0,{"$f":"VLOOKUP($D27,'C.1 - Rate Sheets'!B:F,5,FALSE)","v":0},{"$f":"48/7","v":6.8571428571428568},{"$f":"48/7","v":6.8571428571428568},6.8571428571428568,6.8571428571428568,6.8571428571428568,6.8571428571428568,6.8571428571428568,null,null,null,null,null,null,null,null,{"$f":"SUM(O27:AC27)","v":47.999999999999993},null,null,{"$f":"SUM(AC27:AF27)","v":47.999999999999993},{"$f":"AC27*K27","v":0},6211.6799999999985,0,0,6211.6799999999985,6211.6799999999985,"Yes",0,0,0]
[null,10,null,"Crew Member (other)","Vendor No.01","Crew#2",362494,"2018-10-21","2018-10-27",{"$f":"IF(AND(H28>='A - Contractor Summary'!$C$36,I28<='A - Contractor Summary'!$C$42),\"Yes\",\"No\")","v":"No"},0,102.27,0,{"$f":"VLOOKUP($D28,'C.1 - Rate Sheets'!B:F,5,FALSE)","v":0},{"$f":"48/7","v":6.8571428571428568},6.8571428571428568,6.8571428571428568,6.8571428571428568,6.8571428571428568,6.8571428571428568,6.8571428571428568,null,null,null,null,null,null,null,null,47.999999999999993,null,null,47.999999999999993,0,4908.9599999999991,0,0,4908.9599999999991,4908.9599999999991,"Yes",0,0,0]
[null,11,"R Aguilera","Foreman","Vendor No.01","Crew#2",362494,"2018-10-21","2018-10-27",{"$f":"IF(AND(H29>='A - Contractor Summary'!$C$36,I29<='A - Contractor Summary'!$C$42),\"Yes\",\"No\")","v":"No"},0,114.8,0,{"$f":"VLOOKUP($D29,'C.1 - Rate Sheets'!B:F,5,FALSE)","v":0},6.8571428571428568,6.8571428571428568,6.8571428571428568,6.8571428571428568,6.8571428571428568,6.8571428571428568,6.8571428571428568,null,null,null,null,null,null,null,null,47.999999999999993,null,null,47.999999999999993,0,5510.3999999999987,0,0,5510.3999999999987,5510.3999999999987,"Yes",0,0,0]
[null,12,null,"Crew Member (other)","Vendor No.01","Crew#2",362494,"2018-10-21","2018-10-27",{"$f":"IF(AND(H30>='A - Contractor Summary'!$C$36,I30<='A - Contractor Summary'!$C$42),\"Yes\",\"No\")","v":"No"},0,102.27,0,{"$f":"VLOOKUP($D30,'C.1 - Rate Sheets'!B:F,5,FALSE)","v":0},{"$f":"96/7","v":13.714285714285714},{"$f":"96/7","v":13.714285714285714},13.714285714285714,13.714285714285714,13.714285714285714,13.714285714285714,13.714285714285714,null,null,null,null,null,null,null,null,95.999999999999986,null,null,95.999999999999986,0,9817.9199999999983,0,0,9817.9199999999983,9817.9199999999983,"Yes",0,0,0]
[null,13,"S Mendez","Foreman","Vendor No.01","Crew#2",362494,"2018-10-21","2018-10-27",{"$f":"IF(AND(H31>='A - Contractor Summary'!$C$36,I31<='A - Contractor Summary'!$C$42),\"Yes\",\"No\")","v":"No"},0,114.8,0,{"$f":"VLOOKUP($D31,'C.1 - Rate Sheets'!B:F,5,FALSE)","v":0},{"$f":"48/7","v":6.8571428571428568},{"$f":"48/7","v":6.8571428571428568},6.8571428571428568,6.8571428571428568,6.8571428571428568,6.8571428571428568,6.8571428571428568,null,null,null,null,null,null,null,null,47.999999999999993,null,null,47.999999999999993,0,5510.3999999999987,0,0,5510.3999999999987,5510.3999999999987,"Yes",0,0,0]
[null,14,null,"Crew Member (other)","Vendor No.01","Crew#2",362494,"2018-10-21","2018-10-27",{"$f":"IF(AND(H32>='A - Contractor Summary'!$C$36,I32<='A - Contractor Summary'!$C$42),\"Yes\",\"No\")","v":"No"},0,102.27,0,{"$f":"VLOOKUP($D32,'C.1 - Rate Sheets'!B:F,5,FALSE)","v":0},{"$f":"96/7","v":13.714285714285714},{"$f":"96/7","v":13.714285714285714},13.714285714285714,13.714285714285714,13.714285714285714,13.714285714285714,13.714285714285714,null,null,null,null,null,null,null,null,95.999999999999986,null,null,95.999999999999986,0,9817.9199999999983,0,0,9817.9199999999983,9817.9199999999983,"Yes",0,0,0]
[null,15,"J Arrendondo","Foreman","Vendor No.01","Crew#2",362494,"2018-10-21","2018-10-27",{"$f":"IF(AND(H33>='A - Contractor Summary'!$C$36,I33<='A - Contractor Summary'!$C$42),\"Yes\",\"No\")","v":"No"},0,114.8,0,{"$f":"VLOOKUP($D33,'C.1 - Rate Sheets'!B:F,5,FALSE)","v":0},{"$f":"48/7","v":6.8571428571428568},{"$f":"48/7","v":6.8571428571428568},6.8571428571428568,6.8571428571428568,6.8571428571428568,6.8571428571428568,6.8571428571428568,null,null,null,null,null,null,null,null,47.999999999999993,null,null,47.999999999999993,0,5510.3999999999987,0,0,5510.3999999999987,5510.3999999999987,"Yes",0,0,0]
[null,16,null,"Crew Member (other)","Vendor No.01","Crew#2",362494,"2018-10-21","2018-10-27",{"$f":"IF(AND(H34>='A - Contractor Summary'!$C$36,I34<='A - Contractor Summary'!$C$42),\"Yes\",\"No\")","v":"No"},0,102.27,0,{"$f":"VLOOKUP($D34,'C.1 - Rate Sheets'!B:F,5,FALSE)","v":0},{"$f":"96/7","v":13.714285714285714},{"$f":"96/7","v":13.714285714285714},13.714285714285714,13.714285714285714,13.714285714285714,13.714285714285714,13.714285714285714,null,null,null,null,null,null,null,null,95.999999999999986,null,null,95.999999999999986,0,9817.9199999999983,0,0,9817.9199999999983,9817.9199999999983,"Yes",0,0,0]
[null,17]
[null,18,"Luis Arredondo","General Foreman","Vendor No.01","Crew#1",362569,"2018-10-28","2018-11-03",{"$f":"IF(AND(H36>='A - Contractor Summary'!$C$36,I36<='A - Contractor Summary'!$C$42),\"Yes\",\"No\")","v":"No"},0,129.41,0,{"$f":"VLOOKUP($D36,'C.1 - Rate Sheets'!B:F,5,FALSE)","v":0},null,null,null,null,null,null,null,{"$f":"48/7","v":6.8571428571428568},{"$f":"48/7","v":6.8571428571428568},6.8571428571428568,6.8571428571428568,6.8571428571428568,6.8571428571428568,6.8571428571428568,null,{"$f":"SUM(O36:AC36)","v":47.999999999999993},0,null,{"$f":"SUM(AC36:AF36)","v":47.999999999999993},{"$f":"AC36*K36","v":0},{"$f":"AD36*L36","v":6211.6799999999985},{"$f":"AE36*M36","v":0},{"$f":"AF36*N36","v":0},6211.6799999999985,6211.6799999999985,"Yes",0,0,0]
[null,19,null,"General Foreman","Vendor No.01","Crew#1",362569,"2018-10-28","2018-11-03",{"$f":"IF(AND(H37>='A - Contractor Summary'!$C$36,I37<='A - Contractor Summary'!$C$42),\"Yes\",\"No\")","v":"No"},0,0,172.54,{"$f":"VLOOKUP($D37,'C.1 - Rate Sheets'!B:F,5,FALSE)","v":0},null,null,null,null,null,null,null,{"$f":"16/7","v":2.2857142857142856},{"$f":"16/7","v":2.2857142857142856},2.2857142857142856,2.2857142857142856,2.2857142857142856,2.2857142857142856,2.2857142857142856,null,0,{"$f":"SUM(O37:AC37)","v":15.999999999999996},null,15.999999999999996,0,0,2760.6399999999994,0,2760.6399999999994,2760.6399999999994,"Yes",0,0,0]
[null,20,"Javier Gonzalez","Foreman","Vendor No.01","Crew#1",362569,"2018-10-28","2018-11-03",{"$f":"IF(AND(H38>='A - Contractor Summary'!$C$36,I38<='A - Contractor Summary'!$C$42),\"Yes\",\"No\")","v":"No"},0,114.8,0,{"$f":"VLOOKUP($D38,'C.1 - Rate Sheets'!B:F,5,FALSE)","v":0},null,null,null,null,null,null,null,{"$f":"48/7","v":6.8571428571428568},{"$f":"48/7","v":6.8571428571428568},6.8571428571428568,6.8571428571428568,6.8571428571428568,6.8571428571428568,6.8571428571428568,null,{"$f":"SUM(O38:AC38)","v":47.999999999999993},0,null,47.999999999999993,0,5510.3999999999987,0,0,5510.3999999999987,5510.3999999999987,"Yes",0,0,0]
[null,21,null,"Foreman","Vendor No.01","Crew#1",362569,"2018-10-28","2018-11-03",{"$f":"IF(AND(H39>='A - Contractor Summary'!$C$36,I39<='A - Contractor Summary'!$C$42),\"Yes\",\"No\")","v":"No"},0,0,153.06,{"$f":"VLOOKUP($D39,'C.1 - Rate Sheets'!B:F,5,FALSE)","v":0},null,null,null,null,null,null,null,{"$f":"16/7","v":2.2857142857142856},{"$f":"16/7","v":2.2857142857142856},2.2857142857142856,2.2857142857142856,2.2857142857142856,2.2857142857142856,2.2857142857142856,null,0,{"$f":"SUM(O39:AC39)","v":15.999999999999996},null,15.999999999999996,0,0,2448.9599999999996,0,{"$f":"SUM(AH39:AK39)","v":2448.9599999999996},2448.9599999999996,"Yes",0,0,0]
[null,22,null,"Crew Member (other)","Vendor No.01","Crew#1",362569,"2018-10-28","2018-11-03",{"$f":"IF(AND(H40>='A - Contractor Summary'!$C$36,I40<='A - Contractor Summary'!$C$42),\"Yes\",\"No\")","v":"No"},0,102.27,0,{"$f":"VLOOKUP($D40,'C.1 - Rate Sheets'!B:F,5,FALSE)","v":0},null,null,null,null,null,null,null,{"$f":"96/7","v":13.714285714285714},{"$f":"96/7","v":13.714285714285714},13.714285714285714,13.714285714285714,13.714285714285714,13.714285714285714,13.714285714285714,null,{"$f":"SUM(O40:AC40)","v":95.999999999999986},0,null,95.999999999999986,0,9817.9199999999983,0,0,9817.9199999999983,9817.9199999999983,"Yes",0,0,0]
[null,23,null,"Crew Member (other)","Vendor No.01","Crew#1",362569,"2018-10-28","2018-11-03",{"$f":"IF(AND(H41>='A - Contractor Summary'!$C$36,I41<='A - Contractor Summary'!$C$42),\"Yes\",\"No\")","v":"No"},0,0,136.36000000000001,{"$f":"VLOOKUP($D41,'C.1 - Rate Sheets'!B:F,5,FALSE)","v":0},null,null,null,null,null,null,null,{"$f":"32/7","v":4.5714285714285712},{"$f":"32/7","v":4.5714285714285712},4.5714285714285712,4.5714285714285712,4.5714285714285712,4.5714285714285712,4.5714285714285712,null,0,{"$f":"SUM(O41:AC41)","v":31.999999999999993},null,31.999999999999993,0,0,4363.5199999999995,0,{"$f":"SUM(AH41:AK41)","v":4363.5199999999995},4363.5199999999995,"Yes",0,0,0]
[null,24,"Danny Herrera","Foreman","Vendor No.01","Crew#1",362569,"2018-10-28","2018-11-03",{"$f":"IF(AND(H42>='A - Contractor Summary'!$C$36,I42<='A - Contractor Summary'!$C$42),\"Yes\",\"No\")","v":"No"},0,114.8,0,{"$f":"VLOOKUP($D42,'C.1 - Rate Sheets'!B:F,5,FALSE)","v":0},null,null,null,null,null,null,null,{"$f":"48/7","v":6.8571428571428568},{"$f":"48/7","v":6.8571428571428568},6.8571428571428568,6.8571428571428568,6.8571428571428568,6.8571428571428568,6.8571428571428568,null,{"$f":"SUM(O42:AC42)","v":47.999999999999993},0,null,47.999999999999993,0,5510.3999999999987,0,0,5510.3999999999987,5510.3999999999987,"Yes",0,0,0]
[null,25,null,"Foreman","Vendor No.01","Crew#1",362569,"2018-10-28","2018-11-03",{"$f":"IF(AND(H43>='A - Contractor Summary'!$C$36,I43<='A - Contractor Summary'!$C$42),\"Yes\",\"No\")","v":"No"},0,0,153.06,{"$f":"VLOOKUP($D43,'C.1 - Rate Sheets'!B:F,5,FALSE)","v":0},null,null,null,null,null,null,null,{"$f":"16/7","v":2.2857142857142856},{"$f":"16/7","v":2.2857142857142856},2.2857142857142856,2.2857142857142856,2.2857142857142856,2.2857142857142856,2.2857142857142856,null,0,{"$f":"SUM(O43:AC43)","v":15.999999999999996},null,15.999999999999996,0,0,2448.9599999999996,0,2448.9599999999996,2448.9599999999996,"Yes",0,0,0]
[null,26,null,"Crew Member","Vendor No.01","Crew#1",362569,"2018-10-28","2018-11-03",{"$f":"IF(AND(H44>='A - Contractor Summary'!$C$36,I44<='A - Contractor Summary'!$C$42),\"Yes\",\"No\")","v":"No"},0,83.28,0,{"$f":"VLOOKUP($D44,'C.1 - Rate Sheets'!B:F,5,FALSE)","v":0},null,null,null,null,null,null,null,{"$f":"96/7","v":13.714285714285714},{"$f":"96/7","v":13.714285714285714},13.714285714285714,13.714285714285714,13.714285714285714,13.714285714285714,13.714285714285714,null,{"$f":"SUM(O44:AC44)","v":95.999999999999986},0,null,95.999999999999986,0,7994.8799999999992,0,0,7994.8799999999992,7994.8799999999992,"Yes",0,0,0]
[null,27,null,"Foreman","Vendor No.01","Crew#1",362569,"2018-10-28","2018-11-03",{"$f":"IF(AND(H45>='A - Contractor Summary'!$C$36,I45<='A - Contractor Summary'!$C$42),\"Yes\",\"No\")","v":"No"},0,0,153.06,{"$f":"VLOOKUP($D45,'C.1 - Rate Sheets'!B:F,5,FALSE)","v":0},null,null,null,null,null,null,null,{"$f":"32/7","v":4.5714285714285712},{"$f":"32/7","v":4.5714285714285712},4.5714285714285712,4.5714285714285712,4.5714285714285712,4.5714285714285712,4.5714285714285712,null,0,{"$f":"SUM(O45:AC45)","v":31.999999999999993},null,31.999999999999993,0,0,4897.9199999999992,0,4897.9199999999992,4897.9199999999992,"Yes",0,0,0]
[null,28,"Mario Zarco","Foreman","Vendor No.01","Crew#1",362569,"2018-10-28","2018-11-03",{"$f":"IF(AND(H46>='A - Contractor Summary'!$C$36,I46<='A - Contractor Summary'!$C$42),\"Yes\",\"No\")","v":"No"},0,114.8,0,{"$f":"VLOOKUP($D46,'C.1 - Rate Sheets'!B:F,5,FALSE)","v":0},null,null,null,null,null,null,null,{"$f":"48/7","v":6.8571428571428568},{"$f":"48/7","v":6.8571428571428568},6.8571428571428568,6.8571428571428568,6.8571428571428568,6.8571428571428568,6.8571428571428568,null,{"$f":"SUM(O46:AC46)","v":47.999999999999993},0,null,47.999999999999993,0,5510.3999999999987,0,0,5510.3999999999987,5510.3999999999987,"Yes",0,0,0]
[null,29,null,"Foreman","Vendor No.01","Crew#1",362569,"2018-10-28","2018-11-03",{"$f":"IF(AND(H47>='A - Contractor Summary'!$C$36,I47<='A - Contractor Summary'!$C$42),\"Yes\",\"No\")","v":"No"},0,0,153.06,{"$f":"VLOOKUP($D47,'C.1 - Rate Sheets'!B:F,5,FALSE)","v":0},null,null,null,null,null,null,null,{"$f":"16/7","v":2.2857142857142856},{"$f":"16/7","v":2.2857142857142856},2.2857142857142856,2.2857142857142856,2.2857142857142856,2.2857142857142856,2.2857142857142856,null,0,{"$f":"SUM(O47:AC47)","v":15.999999999999996},null,15.999999999999996,0,0,2448.9599999999996,0,2448.9599999999996,2448.9599999999996,"Yes",0,0,0]
[null,30,null,"Crew Member (other)","Vendor No.01","Crew#1",362569,"2018-10-28","2018-11-03",{"$f":"IF(AND(H48>='A - Contractor Summary'!$C$36,I48<='A - Contractor Summary'!$C$42),\"Yes\",\"No\")","v":"No"},0,102.27,0,{"$f":"VLOOKUP($D48,'C.1 - Rate Sheets'!B:F,5,FALSE)","v":0},null,null,null,null,null,null,null,{"$f":"96/7","v":13.714285714285714},{"$f":"96/7","v":13.714285714285714},13.714285714285714,13.714285714285714,13.714285714285714,13.714285714285714,13.714285714285714,null,{"$f":"SUM(O48:AC48)","v":95.999999999999986},0,null,95.999999999999986,0,9817.9199999999983,0,0,9817.9199999999983,9817.9199999999983,"Yes",0,0,0]
[null,31,null,"Crew Member (other)","Vendor No.01","Crew#1",362569,"2018-10-28","2018-11-03",{"$f":"IF(AND(H49>='A - Contractor Summary'!$C$36,I49<='A - Contractor Summary'!$C$42),\"Yes\",\"No\")","v":"No"},0,0,136.36000000000001,{"$f":"VLOOKUP($D49,'C.1 - Rate Sheets'!B:F,5,FALSE)","v":0},null,null,null,null,null,null,null,{"$f":"32/7","v":4.5714285714285712},{"$f":"32/7","v":4.5714285714285712},4.5714285714285712,4.5714285714285712,4.5714285714285712,4.5714285714285712,4.5714285714285712,null,0,{"$f":"SUM(O49:AC49)","v":31.999999999999993},null,31.999999999999993,0,0,4363.5199999999995,0,4363.5199999999995,4363.5199999999995,"Yes",0,0,0]
[null,32]
[null,33,"Antonio Rodriguez","General Foreman","Vendor No.01","Crew#2",362735,"2018-10-28","2018-11-03",{"$f":"IF(AND(H51>='A - Contractor Summary'!$C$36,I51<='A - Contractor Summary'!$C$42),\"Yes\",\"No\")","v":"No"},0,129.41,0,{"$f":"VLOOKUP($D51,'C.1 - Rate Sheets'!B:F,5,FALSE)","v":0},null,null,null,null,null,null,null,{"$f":"54/7","v":7.7142857142857144},{"$f":"54/7","v":7.7142857142857144},7.7142857142857144,7.7142857142857144,7.7142857142857144,7.7142857142857144,7.7142857142857144,null,{"$f":"SUM(O51:AC51)","v":54},0,null,{"$f":"SUM(AC51:AF51)","v":54},{"$f":"AC51*K51","v":0},{"$f":"AD51*L51","v":6988.1399999999994},{"$f":"AE51*M51","v":0},{"$f":"AF51*N51","v":0},6988.1399999999994,6988.1399999999994,"Yes",0,0,0]
[null,34,"Antonio Rodriguez","General Foreman","Vendor No.01","Crew#2",362735,"2018-10-28","2018-11-03",{"$f":"IF(AND(H52>='A - Contractor Summary'!$C$36,I52<='A - Contractor Summary'!$C$42),\"Yes\",\"No\")","v":"No"},0,0,172.54,{"$f":"VLOOKUP($D52,'C.1 - Rate Sheets'!B:F,5,FALSE)","v":0},null,null,null,null,null,null,null,{"$f":"16/7","v":2.2857142857142856},{"$f":"16/7","v":2.2857142857142856},2.2857142857142856,2.2857142857142856,2.2857142857142856,2.2857142857142856,2.2857142857142856,null,0,{"$f":"SUM(O52:AC52)","v":15.999999999999996},null,15.999999999999996,0,0,2760.6399999999994,0,2760.6399999999994,2760.6399999999994,"Yes",0,0,0]
[null,35,null,"Crew Member (other)","Vendor No.01","Crew#2",362735,"2018-10-28","2018-11-03",{"$f":"IF(AND(H53>='A - Contractor Summary'!$C$36,I53<='A - Contractor Summary'!$C$42),\"Yes\",\"No\")","v":"No"},0,102.27,0,{"$f":"VLOOKUP($D53,'C.1 - Rate Sheets'!B:F,5,FALSE)","v":0},null,null,null,null,null,null,null,{"$f":"44/7","v":6.2857142857142856},{"$f":"44/7","v":6.2857142857142856},6.2857142857142856,6.2857142857142856,6.2857142857142856,6.2857142857142856,6.2857142857142856,null,{"$f":"SUM(O53:AC53)","v":44},0,null,44,0,4499.88,0,0,4499.88,4499.88,"Yes",0,0,0]
[null,36,null,"Crew Member (other)","Vendor No.01","Crew#2",362735,"2018-10-28","2018-11-03",{"$f":"IF(AND(H54>='A - Contractor Summary'!$C$36,I54<='A - Contractor Summary'!$C$42),\"Yes\",\"No\")","v":"No"},0,0,136.36000000000001,{"$f":"VLOOKUP($D54,'C.1 - Rate Sheets'!B:F,5,FALSE)","v":0},null,null,null,null,null,null,null,{"$f":"32/7","v":4.5714285714285712},{"$f":"32/7","v":4.5714285714285712},4.5714285714285712,4.5714285714285712,4.5714285714285712,4.5714285714285712,4.5714285714285712,null,0,{"$f":"SUM(O54:AC54)","v":31.999999999999993},null,31.999999999999993,0,0,4363.5199999999995,0,4363.5199999999995,{"$f":"AL54-AO54","v":4363.5199999999995},"Yes",0,0,0]
[null,37,"Ramon Aguilera","Foreman","Vendor No.01","Crew#2",362735,"2018-10-28","2018-11-03",{"$f":"IF(AND(H55>='A - Contractor Summary'!$C$36,I55<='A - Contractor Summary'!$C$42),\"Yes\",\"No\")","v":"No"},0,114.8,0,{"$f":"VLOOKUP($D55,'C.1 - Rate Sheets'!B:F,5,FALSE)","v":0},null,null,null,null,null,null,null,{"$f":"54/7","v":7.7142857142857144},{"$f":"54/7","v":7.7142857142857144},7.7142857142857144,7.7142857142857144,7.7142857142857144,7.7142857142857144,7.7142857142857144,null,{"$f":"SUM(O55:AC55)","v":54},0,null,54,0,6199.2,0,0,6199.2,6199.2,"Yes",0,0,0]
[null,38,null,"Foreman","Vendor No.01","Crew#2",362735,"2018-10-28","2018-11-03",{"$f":"IF(AND(H56>='A - Contractor Summary'!$C$36,I56<='A - Contractor Summary'!$C$42),\"Yes\",\"No\")","v":"No"},0,0,153.06,{"$f":"VLOOKUP($D56,'C.1 - Rate Sheets'!B:F,5,FALSE)","v":0},null,null,null,null,null,null,null,{"$f":"16/7","v":2.2857142857142856},{"$f":"16/7","v":2.2857142857142856},2.2857142857142856,2.2857142857142856,2.2857142857142856,2.2857142857142856,2.2857142857142856,null,0,{"$f":"SUM(O56:AC56)","v":15.999999999999996},null,15.999999999999996,0,0,2448.9599999999996,0,2448.9599999999996,2448.9599999999996,"Yes",0,0,0]
[null,39,null,"Crew Member (other)","Vendor No.01","Crew#2",362735,"2018-10-28","2018-11-03",{"$f":"IF(AND(H57>='A - Contractor Summary'!$C$36,I57<='A - Contractor Summary'!$C$42),\"Yes\",\"No\")","v":"No"},0,102.27,0,{"$f":"VLOOKUP($D57,'C.1 - Rate Sheets'!B:F,5,FALSE)","v":0},null,null,null,null,null,null,null,{"$f":"108/7","v":15.428571428571429},{"$f":"108/7","v":15.428571428571429},15.428571428571429,15.428571428571429,15.428571428571429,15.428571428571429,15.428571428571429,null,{"$f":"SUM(O57:AC57)","v":108},0,null,108,0,11045.16,0,0,11045.16,11045.16,"Yes",0,0,0]
[null,40,null,"Crew Member (other)","Vendor No.01","Crew#2",362735,"2018-10-28","2018-11-03",{"$f":"IF(AND(H58>='A - Contractor Summary'!$C$36,I58<='A - Contractor Summary'!$C$42),\"Yes\",\"No\")","v":"No"},0,0,136.36000000000001,{"$f":"VLOOKUP($D58,'C.1 - Rate Sheets'!B:F,5,FALSE)","v":0},null,null,null,null,null,null,null,{"$f":"32/7","v":4.5714285714285712},{"$f":"32/7","v":4.5714285714285712},4.5714285714285712,4.5714285714285712,4.5714285714285712,4.5714285714285712,4.5714285714285712,null,0,{"$f":"SUM(O58:AC58)","v":31.999999999999993},null,31.999999999999993,0,0,4363.5199999999995,0,4363.5199999999995,4363.5199999999995,"Yes",0,0,0]
[null,41,"Jose Arredondo","Foreman","Vendor No.01","Crew#2",362735,"2018-10-28","2018-11-03",{"$f":"IF(AND(H59>='A - Contractor Summary'!$C$36,I59<='A - Contractor Summary'!$C$42),\"Yes\",\"No\")","v":"No"},0,114.8,0,{"$f":"VLOOKUP($D59,'C.1 - Rate Sheets'!B:F,5,FALSE)","v":0},null,null,null,null,null,null,null,{"$f":"32/7","v":4.5714285714285712},4.5714285714285712,4.5714285714285712,4.5714285714285712,4.5714285714285712,4.5714285714285712,4.5714285714285712,null,{"$f":"SUM(O59:AC59)","v":31.999999999999993},0,null,31.999999999999993,0,3673.599999999999,0,0,3673.599999999999,3673.599999999999,"Yes",0,0,0]
[null,42,null,"Crew Member (other)","Vendor No.01","Crew#2",362735,"2018-10-28","2018-11-03",{"$f":"IF(AND(H60>='A - Contractor Summary'!$C$36,I60<='A - Contractor Summary'!$C$42),\"Yes\",\"No\")","v":"No"},0,0,136.36000000000001,{"$f":"VLOOKUP($D60,'C.1 - Rate Sheets'!B:F,5,FALSE)","v":0},null,null,null,null,null,null,null,{"$f":"16/7","v":2.2857142857142856},{"$f":"16/7","v":2.2857142857142856},2.2857142857142856,2.2857142857142856,2.2857142857142856,2.2857142857142856,2.2857142857142856,null,0,{"$f":"SUM(O60:AC60)","v":15.999999999999996},null,15.999999999999996,0,0,2181.7599999999998,0,2181.7599999999998,2181.7599999999998,"Yes",0,0,0]
[null,43,null,"Crew Member (other)","Vendor No.01","Crew#2",362735,"2018-10-28","2018-11-03",{"$f":"IF(AND(H61>='A - Contractor Summary'!$C$36,I61<='A - Contractor Summary'!$C$42),\"Yes\",\"No\")","v":"No"},0,102.27,0,{"$f":"VLOOKUP($D61,'C.1 - Rate Sheets'!B:F,5,FALSE)","v":0},null,null,null,null,null,null,null,{"$f":"108/7","v":15.428571428571429},{"$f":"108/7","v":15.428571428571429},15.428571428571429,15.428571428571429,15.428571428571429,15.428571428571429,15.428571428571429,null,{"$f":"SUM(O61:AC61)","v":108},0,null,108,0,11045.16,0,0,11045.16,11045.16,"Yes",0,0,0]
[null,44,null,"Crew Member (other)","Vendor No.01","Crew#2",362735,"2018-10-28","2018-11-03",{"$f":"IF(AND(H62>='A - Contractor Summary'!$C$36,I62<='A - Contractor Summary'!$C$42),\"Yes\",\"No\")","v":"No"},0,0,136.36000000000001,{"$f":"VLOOKUP($D62,'C.1 - Rate Sheets'!B:F,5,FALSE)","v":0},null,null,null,null,null,null,null,{"$f":"32/7","v":4.5714285714285712},{"$f":"32/7","v":4.5714285714285712},4.5714285714285712,4.5714285714285712,4.5714285714285712,4.5714285714285712,4.5714285714285712,null,0,{"$f":"SUM(O62:AC62)","v":31.999999999999993},null,31.999999999999993,0,0,4363.5199999999995,0,4363.5199999999995,4363.5199999999995,"Yes",0,0,0]
[null,45,"Saul Mendez","Foreman","Vendor No.01","Crew#2",362735,"2018-10-28","2018-11-03",{"$f":"IF(AND(H63>='A - Contractor Summary'!$C$36,I63<='A - Contractor Summary'!$C$42),\"Yes\",\"No\")","v":"No"},0,114.8,0,{"$f":"VLOOKUP($D63,'C.1 - Rate Sheets'!B:F,5,FALSE)","v":0},null,null,null,null,null,null,null,{"$f":"54/7","v":7.7142857142857144},{"$f":"54/7","v":7.7142857142857144},7.7142857142857144,7.7142857142857144,7.7142857142857144,7.7142857142857144,7.7142857142857144,null,{"$f":"SUM(O63:AC63)","v":54},0,null,54,0,6199.2,0,0,6199.2,6199.2,"Yes",0,0,0]
[null,46,null,"Foreman","Vendor No.01","Crew#2",362735,"2018-10-28","2018-11-03",{"$f":"IF(AND(H64>='A - Contractor Summary'!$C$36,I64<='A - Contractor Summary'!$C$42),\"Yes\",\"No\")","v":"No"},0,0,153.06,{"$f":"VLOOKUP($D64,'C.1 - Rate Sheets'!B:F,5,FALSE)","v":0},null,null,null,null,null,null,null,{"$f":"16/7","v":2.2857142857142856},{"$f":"16/7","v":2.2857142857142856},2.2857142857142856,2.2857142857142856,2.2857142857142856,2.2857142857142856,2.2857142857142856,null,0,{"$f":"SUM(O64:AC64)","v":15.999999999999996},null,15.999999999999996,0,0,2448.9599999999996,0,2448.9599999999996,2448.9599999999996,"Yes",0,0,0]
[null,47,null,"Crew Member (other)","Vendor No.01","Crew#2",362735,"2018-10-28","2018-11-03",{"$f":"IF(AND(H65>='A - Contractor Summary'!$C$36,I65<='A - Contractor Summary'!$C$42),\"Yes\",\"No\")","v":"No"},0,102.27,0,{"$f":"VLOOKUP($D65,'C.1 - Rate Sheets'!B:F,5,FALSE)","v":0},null,null,null,null,null,null,null,{"$f":"108/7","v":15.428571428571429},{"$f":"108/7","v":15.428571428571429},15.428571428571429,15.428571428571429,15.428571428571429,15.428571428571429,15.428571428571429,null,{"$f":"SUM(O65:AC65)","v":108},0,null,108,0,11045.16,0,0,11045.16,11045.16,"Yes",0,0,0]
[null,48,null,"Crew Member (other)","Vendor No.01","Crew#2",362735,"2018-10-28","2018-11-03",{"$f":"IF(AND(H66>='A - Contractor Summary'!$C$36,I66<='A - Contractor Summary'!$C$42),\"Yes\",\"No\")","v":"No"},0,0,136.36000000000001,{"$f":"VLOOKUP($D66,'C.1 - Rate Sheets'!B:F,5,FALSE)","v":0},null,null,null,null,null,null,null,{"$f":"32/7","v":4.5714285714285712},{"$f":"32/7","v":4.5714285714285712},4.5714285714285712,4.5714285714285712,4.5714285714285712,4.5714285714285712,4.5714285714285712,null,0,{"$f":"SUM(O66:AC66)","v":31.999999999999993},null,31.999999999999993,0,0,4363.5199999999995,0,4363.5199999999995,4363.5199999999995,"Yes",null,0,0]
[null,null,null,null,null,null,null,null,null,null,null,null,null," ",{"$f":"SUM(O19:O66)","v":134.57142857142858},134.57142857142858,134.57142857142858,134.57142857142858,134.57142857142858,134.57142857142858,134.57142857142858,199.14285714285714,199.14285714285714,199.14285714285714,199.14285714285714,{"$f":"SUM(Z19:Z66)","v":199.14285714285714},199.14285714285714,199.14285714285714,{"$f":"SUM(AC19:AC66)","v":0},{"$f":"SUM(AD19:AD66)","v":1983.9999999999998},{"$f":"SUM(AE19:AE66)","v":351.99999999999994},{"$f":"SUM(AF19:AF66)","v":0},{"$f":"SUM(AC67:AF67)","v":2335.9999999999995},{"$f":"SUM(AH19:AH66)","v":0},{"$f":"SUM(AI19:AI66)","v":211744.97999999998},{"$f":"SUM(AJ19:AJ66)","v":51026.87999999999},{"$f":"SUM(AK19:AK66)","v":0},{"$f":"IFERROR(SUM(AL19:AL66),0)","v":262771.85999999993},{"$f":"AL67-AO67","v":262771.85999999993},null,{"$f":"SUM(AO19:AO66)","v":0},{"$f":"SUM(AP19:AP66)","v":0},{"$f":"SUM(AQ19:AQ66)","v":0},{"$f":"AO67-AP67-AQ67","v":0},"check (b)"]
[null,null,null,null,null,null,null,null,null,null,null,null,null," ","Total # of Crew",null,null,null,{"$f":"COUNTIF(S19:S66,\">0\")","v":15},null,null,"Total # of Crew",null,null,null,{"$f":"COUNTIF(Z19:Z66,\">0\")","v":30},"Total # of Crew",null,"# of time charges",null,null,null,null,null,null,null,null,null," "]
[]
[]
[]
[]
[]
[]
[]
[null,"Tickmark Explanation:"]
[]
[null,1]
[null,2]
[null,3]

{"sheet":"C.3 - Asset by Company","index":6,"n_rows":1,"n_cols":3,"rows_kept":1,"cut":false,"hidden":false,"merged":[]}
["Asset Tag","Position","Name"]

{"sheet":"C.4 - Timesheets - Equipment","index":7,"n_rows":70,"n_cols":33,"rows_kept":70,"cut":false,"hidden":false,"merged":[[1,1,1,31],[14,29,16,29],[14,30,16,30],[14,31,16,31],[14,26,16,26],[14,28,16,28],[14,27,16,27],[3,2,8,9],[63,1,63,5],[14,25,16,25],[14,10,16,10],[14,1,16,1],[14,2,16,2],[14,4,16,4],[14,5,16,5],[14,6,16,6],[14,9,16,9],[14,7,16,7],[14,8,16,8],[14,3,16,3]]}
[]
[null,"Equipment Charges - Time Card"]
[]
[null,"Test Plan:","Obtain the time cards.  (A) Populate the equipment names and types (if provided). Find additional information regarding individual equipment charge from related invoice. (B) Enter hours worked from time card(s).   (C) Confirm that the dates per the time cards fall between dates provided per 'A - Contractor Summary' tab. (D) Identify any equipment charges to be reviewed.  (E) For charges which required further review, document review (include why it was determined to be allowed/disallowed via a tickmark)."]
[]
[]
[]
[]
[]
[null,"Rx","Recalculated.",null,null,null,null,null,null,null,{"$f":"685.52/2.09","v":328}]
[null,"a","Provided from tab 'C.1 - Rate Sheets'."]
[null,"b","Check figure should equal $0.  Cell will appear yellow if discrepancies are noted."]
[]
[null,null,"A ",null,null,null,null,"Rx",null,"C","a","B",null,null,null,null,null,null,null,null,null,null,null,null,null,"Rx",null,null,"D","E"]
[null,"#","Equipment Name","Equipment ID","Company","Crew#","Invoice","Start Date","End Date","Dates Worked Reasonable?","Rates","2018-10-21","2018-10-22","2018-10-23","2018-10-24","2018-10-25","2018-10-26","2018-10-27","2018-10-28","2018-10-29","2018-10-30","2018-10-31","2018-11-01","2018-11-02","2018-11-03","Total Hours","Total Equipment $","Allowable Charges","To Be Reviewed","Reviewed - Allowable Charge","Reviewed - Unallowable Charge","Tickmarks"]
[null,null,null,null,null,null,null,null,null,null,null,"Sunday","Monday","Tuesday","Wednesday","Thursday","Friday","Saturday","Sunday","Monday","Tuesday","Wednesday","Thursday","Friday","Saturday"]
[null,null,null,null,null,null,null,null,null,null,null,"Hours","Hours","Hours","Hours","Hours","Hours","Hours","Hours","Hours","Hours","Hours","Hours","Hours","Hours"]
[null,1,"Pick-Up",null,"Vendor No. 01","Crew#1",362473,"2018-10-21","2018-10-27",{"$f":"IF(AND(H18>='A - Contractor Summary'!$C$36,I18<='A - Contractor Summary'!$C$42),\"Yes\",\"No\")","v":"No"},{"$f":"VLOOKUP($C18,'C.1 - Rate Sheets'!H:I,2,FALSE)","v":28.75},{"$f":"46/7","v":6.5714285714285712},{"$f":"46/7","v":6.5714285714285712},6.5714285714285712,6.5714285714285712,6.5714285714285712,6.5714285714285712,6.5714285714285712,null,null,null,null,null,null,null,{"$f":"SUM(L18:Y18)","v":45.999999999999993},{"$f":"Z18*K18","v":1322.4999999999998},{"$f":"AA18-AC18","v":1322.4999999999998},0,0,0]
[null,2,"Mobilization on Equipment (1 ton or less)",null,"Vendor No.01","Crew#1",362473,"2018-10-21","2018-10-27",{"$f":"IF(AND(H19>='A - Contractor Summary'!$C$36,I19<='A - Contractor Summary'!$C$42),\"Yes\",\"No\")","v":"No"},{"$f":"VLOOKUP($C19,'C.1 - Rate Sheets'!H:I,2,FALSE)","v":2.09},{"$f":"478/7","v":68.285714285714292},{"$f":"478/7","v":68.285714285714292},68.285714285714292,68.285714285714292,68.285714285714292,68.285714285714292,68.285714285714292,null,null,null,null,null,null,null,478,999.02,999.02,0,0,0]
[null,3,"Mobilization on Equipment (1 ton or less)",null,"Vendor No.01","Crew#1",362473,"2018-10-21","2018-10-27",{"$f":"IF(AND(H20>='A - Contractor Summary'!$C$36,I20<='A - Contractor Summary'!$C$42),\"Yes\",\"No\")","v":"No"},{"$f":"VLOOKUP($C20,'C.1 - Rate Sheets'!H:I,2,FALSE)","v":2.09},{"$f":"180/7","v":25.714285714285715},{"$f":"180/7","v":25.714285714285715},25.714285714285715,25.714285714285715,25.714285714285715,25.714285714285715,25.714285714285715,null,null,null,null,null,null,null,180.00000000000003,376.20000000000005,376.20000000000005,0,0,0]
[null,4,"55' Lift",null,"Vendor No.01","Crew#1",362473,"2018-10-21","2018-10-27",{"$f":"IF(AND(H21>='A - Contractor Summary'!$C$36,I21<='A - Contractor Summary'!$C$42),\"Yes\",\"No\")","v":"No"},{"$f":"VLOOKUP($C21,'C.1 - Rate Sheets'!H:I,2,FALSE)","v":44.28},{"$f":"46/7","v":6.5714285714285712},{"$f":"46/7","v":6.5714285714285712},6.5714285714285712,6.5714285714285712,6.5714285714285712,6.5714285714285712,6.5714285714285712,null,null,null,null,null,null,null,45.999999999999993,2036.8799999999997,2036.8799999999997,0,0,0]
[null,5,"Mobilization on Equipment (More than 1 ton)",null,"Vendor No.01","Crew#1",362473,"2018-10-21","2018-10-27",{"$f":"IF(AND(H22>='A - Contractor Summary'!$C$36,I22<='A - Contractor Summary'!$C$42),\"Yes\",\"No\")","v":"No"},{"$f":"VLOOKUP($C22,'C.1 - Rate Sheets'!H:I,2,FALSE)","v":2.78},{"$f":"658/7","v":94},{"$f":"658/7","v":94},94,94,94,94,94,null,null,null,null,null,null,null,658,1829.2399999999998,1829.2399999999998,0,0,0]
[null,6,"60/70' Bucket ",null,"Vendor No.01","Crew#1",362473,"2018-10-21","2018-10-27",{"$f":"IF(AND(H23>='A - Contractor Summary'!$C$36,I23<='A - Contractor Summary'!$C$42),\"Yes\",\"No\")","v":"No"},{"$f":"VLOOKUP($C23,'C.1 - Rate Sheets'!H:I,2,FALSE)","v":63.25},{"$f":"46/7","v":6.5714285714285712},{"$f":"46/7","v":6.5714285714285712},6.5714285714285712,6.5714285714285712,6.5714285714285712,6.5714285714285712,6.5714285714285712,null,null,null,null,null,null,null,45.999999999999993,2909.4999999999995,2909.4999999999995,0,0,0]
[null,7,"Mobilization on Equipment (More than 1 ton)",null,"Vendor No.01","Crew#1",362473,"2018-10-21","2018-10-27",{"$f":"IF(AND(H24>='A - Contractor Summary'!$C$36,I24<='A - Contractor Summary'!$C$42),\"Yes\",\"No\")","v":"No"},{"$f":"VLOOKUP($C24,'C.1 - Rate Sheets'!H:I,2,FALSE)","v":2.78},{"$f":"658/7","v":94},{"$f":"658/7","v":94},94,94,94,94,94,null,null,null,null,null,null,null,658,1829.2399999999998,1829.2399999999998,0,0,0]
[null,8,"60/70' Bucket ",null,"Vendor No.01","Crew#1",362473,"2018-10-21","2018-10-27",{"$f":"IF(AND(H25>='A - Contractor Summary'!$C$36,I25<='A - Contractor Summary'!$C$42),\"Yes\",\"No\")","v":"No"},{"$f":"VLOOKUP($C25,'C.1 - Rate Sheets'!H:I,2,FALSE)","v":63.25},{"$f":"46/7","v":6.5714285714285712},{"$f":"46/7","v":6.5714285714285712},6.5714285714285712,6.5714285714285712,6.5714285714285712,6.5714285714285712,6.5714285714285712,null,null,null,null,null,null,null,45.999999999999993,2909.4999999999995,2909.4999999999995,0,0,0]
[null,9,"Mobilization on Equipment (More than 1 ton)",null,"Vendor No.01","Crew#1",362473,"2018-10-21","2018-10-27",{"$f":"IF(AND(H26>='A - Contractor Summary'!$C$36,I26<='A - Contractor Summary'!$C$42),\"Yes\",\"No\")","v":"No"},{"$f":"VLOOKUP($C26,'C.1 - Rate Sheets'!H:I,2,FALSE)","v":2.78},{"$f":"658/7","v":94},{"$f":"658/7","v":94},94,94,94,94,94,null,null,null,null,null,null,null,658,1829.2399999999998,1829.2399999999998,0,0,0]
[]
[null,10,"Pick-Up",null,"Vendor No.01","Crew#2",362494,"2018-10-21","2018-10-27",{"$f":"IF(AND(H28>='A - Contractor Summary'!$C$36,I28<='A - Contractor Summary'!$C$42),\"Yes\",\"No\")","v":"No"},{"$f":"VLOOKUP($C28,'C.1 - Rate Sheets'!H:I,2,FALSE)","v":28.75},{"$f":"48/7","v":6.8571428571428568},{"$f":"48/7","v":6.8571428571428568},6.8571428571428568,6.8571428571428568,6.8571428571428568,6.8571428571428568,6.8571428571428568,null,null,null,null,null,null,null,{"$f":"SUM(L28:Y28)","v":47.999999999999993},{"$f":"Z28*K28","v":1379.9999999999998},1379.9999999999998,0,0,0]
[null,11,"Mobilization on Equipment (1 ton or less)",null,"Vendor No.01","Crew#2",362494,"2018-10-21","2018-10-27",{"$f":"IF(AND(H29>='A - Contractor Summary'!$C$36,I29<='A - Contractor Summary'!$C$42),\"Yes\",\"No\")","v":"No"},{"$f":"VLOOKUP($C29,'C.1 - Rate Sheets'!H:I,2,FALSE)","v":2.09},{"$f":"328/7","v":46.857142857142854},{"$f":"328/7","v":46.857142857142854},46.857142857142854,46.857142857142854,46.857142857142854,46.857142857142854,46.857142857142854,null,null,null,null,null,null,null,327.99999999999994,685.51999999999987,685.51999999999987,0,0,0]
[null,12,"Mobilization on Equipment (1 ton or less)",null,"Vendor No.01","Crew#2",362494,"2018-10-21","2018-10-27",{"$f":"IF(AND(H30>='A - Contractor Summary'!$C$36,I30<='A - Contractor Summary'!$C$42),\"Yes\",\"No\")","v":"No"},{"$f":"VLOOKUP($C30,'C.1 - Rate Sheets'!H:I,2,FALSE)","v":2.09},{"$f":"337/7","v":48.142857142857146},{"$f":"337/7","v":48.142857142857146},48.142857142857146,48.142857142857146,48.142857142857146,48.142857142857146,48.142857142857146,null,null,null,null,null,null,null,337.00000000000006,704.33,704.33,0,0,0]
[null,13,"Pick-Up",null,"Vendor No.01","Crew#2",362494,"2018-10-21","2018-10-27",{"$f":"IF(AND(H31>='A - Contractor Summary'!$C$36,I31<='A - Contractor Summary'!$C$42),\"Yes\",\"No\")","v":"No"},{"$f":"VLOOKUP($C31,'C.1 - Rate Sheets'!H:I,2,FALSE)","v":28.75},{"$f":"48/7","v":6.8571428571428568},{"$f":"48/7","v":6.8571428571428568},6.8571428571428568,6.8571428571428568,6.8571428571428568,6.8571428571428568,6.8571428571428568,null,null,null,null,null,null,null,47.999999999999993,1379.9999999999998,1379.9999999999998,0,0,0]
[null,14,"Mobilization on Equipment (1 ton or less)",null,"Vendor No.01","Crew#2",362494,"2018-10-21","2018-10-27",{"$f":"IF(AND(H32>='A - Contractor Summary'!$C$36,I32<='A - Contractor Summary'!$C$42),\"Yes\",\"No\")","v":"No"},{"$f":"VLOOKUP($C32,'C.1 - Rate Sheets'!H:I,2,FALSE)","v":2.09},{"$f":"328/7","v":46.857142857142854},{"$f":"328/7","v":46.857142857142854},46.857142857142854,46.857142857142854,46.857142857142854,46.857142857142854,46.857142857142854,null,null,null,null,null,null,null,327.99999999999994,685.51999999999987,685.51999999999987,0,0,0]
[null,15,"Mobilization on Equipment (1 ton or less)",null,"Vendor No.01","Crew#2",362494,"2018-10-21","2018-10-27",{"$f":"IF(AND(H33>='A - Contractor Summary'!$C$36,I33<='A - Contractor Summary'!$C$42),\"Yes\",\"No\")","v":"No"},{"$f":"VLOOKUP($C33,'C.1 - Rate Sheets'!H:I,2,FALSE)","v":2.09},{"$f":"337/7","v":48.142857142857146},{"$f":"337/7","v":48.142857142857146},48.142857142857146,48.142857142857146,48.142857142857146,48.142857142857146,48.142857142857146,null,null,null,null,null,null,null,337.00000000000006,704.33,704.33,0,0,0]
[null,16,"Pick-Up",null,"Vendor No.01","Crew#2",362494,"2018-10-21","2018-10-27",{"$f":"IF(AND(H34>='A - Contractor Summary'!$C$36,I34<='A - Contractor Summary'!$C$42),\"Yes\",\"No\")","v":"No"},{"$f":"VLOOKUP($C34,'C.1 - Rate Sheets'!H:I,2,FALSE)","v":28.75},{"$f":"48/7","v":6.8571428571428568},{"$f":"48/7","v":6.8571428571428568},6.8571428571428568,6.8571428571428568,6.8571428571428568,6.8571428571428568,6.8571428571428568,null,null,null,null,null,null,null,47.999999999999993,1379.9999999999998,1379.9999999999998,0,0,0]
[null,17,"Mobilization on Equipment (1 ton or less)",null,"Vendor No.01","Crew#2",362494,"2018-10-21","2018-10-27",{"$f":"IF(AND(H35>='A - Contractor Summary'!$C$36,I35<='A - Contractor Summary'!$C$42),\"Yes\",\"No\")","v":"No"},{"$f":"VLOOKUP($C35,'C.1 - Rate Sheets'!H:I,2,FALSE)","v":2.09},{"$f":"328/7","v":46.857142857142854},{"$f":"328/7","v":46.857142857142854},46.857142857142854,46.857142857142854,46.857142857142854,46.857142857142854,46.857142857142854,null,null,null,null,null,null,null,327.99999999999994,685.51999999999987,685.51999999999987,0,0,0]
[null,18,"Mobilization on Equipment (1 ton or less)",null,"Vendor No.01","Crew#2",362494,"2018-10-21","2018-10-27",{"$f":"IF(AND(H36>='A - Contractor Summary'!$C$36,I36<='A - Contractor Summary'!$C$42),\"Yes\",\"No\")","v":"No"},{"$f":"VLOOKUP($C36,'C.1 - Rate Sheets'!H:I,2,FALSE)","v":2.09},{"$f":"337/7","v":48.142857142857146},{"$f":"337/7","v":48.142857142857146},48.142857142857146,48.142857142857146,48.142857142857146,48.142857142857146,48.142857142857146,null,null,null,null,null,null,null,337.00000000000006,704.33,704.33,0,0,0]
[null,19,"Pick-Up",null,"Vendor No.01","Crew#2",362494,"2018-10-21","2018-10-27",{"$f":"IF(AND(H37>='A - Contractor Summary'!$C$36,I37<='A - Contractor Summary'!$C$42),\"Yes\",\"No\")","v":"No"},{"$f":"VLOOKUP($C37,'C.1 - Rate Sheets'!H:I,2,FALSE)","v":28.75},{"$f":"48/7","v":6.8571428571428568},{"$f":"48/7","v":6.8571428571428568},6.8571428571428568,6.8571428571428568,6.8571428571428568,6.8571428571428568,6.8571428571428568,null,null,null,null,null,null,null,47.999999999999993,1379.9999999999998,1379.9999999999998,0,0,0]
[null,20,"Mobilization on Equipment (1 ton or less)",null,"Vendor No.01","Crew#2",362494,"2018-10-21","2018-10-27",{"$f":"IF(AND(H38>='A - Contractor Summary'!$C$36,I38<='A - Contractor Summary'!$C$42),\"Yes\",\"No\")","v":"No"},{"$f":"VLOOKUP($C38,'C.1 - Rate Sheets'!H:I,2,FALSE)","v":2.09},{"$f":"328/7","v":46.857142857142854},{"$f":"328/7","v":46.857142857142854},46.857142857142854,46.857142857142854,46.857142857142854,46.857142857142854,46.857142857142854,null,null,null,null,null,null,null,327.99999999999994,685.51999999999987,685.51999999999987,0,0,0]
[null,21,"Mobilization on Equipment (1 ton or less)",null,"Vendor No.01","Crew#2",362494,"2018-10-21","2018-10-27",{"$f":"IF(AND(H39>='A - Contractor Summary'!$C$36,I39<='A - Contractor Summary'!$C$42),\"Yes\",\"No\")","v":"No"},{"$f":"VLOOKUP($C39,'C.1 - Rate Sheets'!H:I,2,FALSE)","v":2.09},{"$f":"337/7","v":48.142857142857146},{"$f":"337/7","v":48.142857142857146},48.142857142857146,48.142857142857146,48.142857142857146,48.142857142857146,48.142857142857146,null,null,null,null,null,null,null,337.00000000000006,704.33,704.33,0,0,0]
[]
[null,22,"Pick-Up",null,"Vendor No.01","Crew#1",362569,"2018-10-28","2018-11-03",{"$f":"IF(AND(H41>='A - Contractor Summary'!$C$36,I41<='A - Contractor Summary'!$C$42),\"Yes\",\"No\")","v":"No"},{"$f":"VLOOKUP($C41,'C.1 - Rate Sheets'!H:I,2,FALSE)","v":28.75},null,null,null,null,null,null,null,{"$f":"64/7","v":9.1428571428571423},9.1428571428571423,9.1428571428571423,9.1428571428571423,9.1428571428571423,9.1428571428571423,9.1428571428571423,{"$f":"SUM(L41:Y41)","v":63.999999999999986},{"$f":"Z41*K41","v":1839.9999999999995},1839.9999999999995,0,0,0]
[null,23,"Mobilization on Equipment (1 ton or less)",null,"Vendor No.01","Crew#1",362569,"2018-10-28","2018-11-03",{"$f":"IF(AND(H42>='A - Contractor Summary'!$C$36,I42<='A - Contractor Summary'!$C$42),\"Yes\",\"No\")","v":"No"},{"$f":"VLOOKUP($C42,'C.1 - Rate Sheets'!H:I,2,FALSE)","v":2.09},null,null,null,null,null,null,null,{"$f":"609/7","v":87},{"$f":"609/7","v":87},87,87,87,87,87,609,1272.81,1272.81,0,0,0]
[null,24,"55' Lift",null,"Vendor No.01","Crew#1",362569,"2018-10-28","2018-11-03",{"$f":"IF(AND(H43>='A - Contractor Summary'!$C$36,I43<='A - Contractor Summary'!$C$42),\"Yes\",\"No\")","v":"No"},{"$f":"VLOOKUP($C43,'C.1 - Rate Sheets'!H:I,2,FALSE)","v":44.28},null,null,null,null,null,null,null,{"$f":"64/7","v":9.1428571428571423},{"$f":"64/7","v":9.1428571428571423},9.1428571428571423,9.1428571428571423,9.1428571428571423,9.1428571428571423,9.1428571428571423,63.999999999999986,2833.9199999999996,2833.9199999999996,0,0,0]
[null,25,"Mobilization on Equipment (More than 1 ton)",null,"Vendor No.01","Crew#1",362569,"2018-10-28","2018-11-03",{"$f":"IF(AND(H44>='A - Contractor Summary'!$C$36,I44<='A - Contractor Summary'!$C$42),\"Yes\",\"No\")","v":"No"},{"$f":"VLOOKUP($C44,'C.1 - Rate Sheets'!H:I,2,FALSE)","v":2.78},null,null,null,null,null,null,null,{"$f":"609/7","v":87},{"$f":"609/7","v":87},87,87,87,87,87,609,1693.02,1693.02,0,0,0]
[null,26,"60/70' Bucket ",null,"Vendor No.01","Crew#1",362569,"2018-10-28","2018-11-03",{"$f":"IF(AND(H45>='A - Contractor Summary'!$C$36,I45<='A - Contractor Summary'!$C$42),\"Yes\",\"No\")","v":"No"},{"$f":"VLOOKUP($C45,'C.1 - Rate Sheets'!H:I,2,FALSE)","v":63.25},null,null,null,null,null,null,null,{"$f":"46/7","v":6.5714285714285712},{"$f":"46/7","v":6.5714285714285712},6.5714285714285712,6.5714285714285712,6.5714285714285712,6.5714285714285712,6.5714285714285712,45.999999999999993,2909.4999999999995,{"$f":"AA45-AC45","v":2909.4999999999995},0,0,0]
[null,27,"Mobilization on Equipment (More than 1 ton)",null,"Vendor No.01","Crew#1",362569,"2018-10-28","2018-11-03",{"$f":"IF(AND(H46>='A - Contractor Summary'!$C$36,I46<='A - Contractor Summary'!$C$42),\"Yes\",\"No\")","v":"No"},{"$f":"VLOOKUP($C46,'C.1 - Rate Sheets'!H:I,2,FALSE)","v":2.78},null,null,null,null,null,null,null,{"$f":"609/7","v":87},{"$f":"609/7","v":87},87,87,87,87,87,609,1693.02,1693.02,0,0,0]
[null,28,"60/70' Bucket ",null,"Vendor No.01","Crew#1",362569,"2018-10-28","2018-11-03",{"$f":"IF(AND(H47>='A - Contractor Summary'!$C$36,I47<='A - Contractor Summary'!$C$42),\"Yes\",\"No\")","v":"No"},{"$f":"VLOOKUP($C47,'C.1 - Rate Sheets'!H:I,2,FALSE)","v":63.25},null,null,null,null,null,null,null,{"$f":"64/7","v":9.1428571428571423},{"$f":"64/7","v":9.1428571428571423},9.1428571428571423,9.1428571428571423,9.1428571428571423,9.1428571428571423,9.1428571428571423,63.999999999999986,4047.9999999999991,4047.9999999999991,0,0,0]
[null,29,"Mobilization on Equipment (More than 1 ton)",null,"Vendor No.01","Crew#1",362569,"2018-10-28","2018-11-03",{"$f":"IF(AND(H48>='A - Contractor Summary'!$C$36,I48<='A - Contractor Summary'!$C$42),\"Yes\",\"No\")","v":"No"},{"$f":"VLOOKUP($C48,'C.1 - Rate Sheets'!H:I,2,FALSE)","v":2.78},null,null,null,null,null,null,null,{"$f":"609/7","v":87},{"$f":"609/7","v":87},87,87,87,87,87,609,1693.02,1693.02,0,0,0]
[]
[null,30,"Pick-Up",null,"Vendor No.01","Crew#2",362735,"2018-10-28","2018-11-03",{"$f":"IF(AND(H50>='A - Contractor Summary'!$C$36,I50<='A - Contractor Summary'!$C$42),\"Yes\",\"No\")","v":"No"},{"$f":"VLOOKUP($C50,'C.1 - Rate Sheets'!H:I,2,FALSE)","v":28.75},null,null,null,null,null,null,null,{"$f":"70/7","v":10},{"$f":"70/7","v":10},10,10,10,10,10,{"$f":"SUM(L50:Y50)","v":70},{"$f":"Z50*K50","v":2012.5},2012.5,0,0,0]
[null,31,"Mobilization on Equipment (1 ton or less)",null,"Vendor No.01","Crew#2",362735,"2018-10-28","2018-11-03",{"$f":"IF(AND(H51>='A - Contractor Summary'!$C$36,I51<='A - Contractor Summary'!$C$42),\"Yes\",\"No\")","v":"No"},{"$f":"VLOOKUP($C51,'C.1 - Rate Sheets'!H:I,2,FALSE)","v":2.09},null,null,null,null,null,null,null,{"$f":"336/7","v":48},{"$f":"336/7","v":48},48,48,48,48,48,336,702.24,702.24,0,0,0]
[null,32,"Mobilization on Equipment (1 ton or less)",null,"Vendor No.01","Crew#2",362735,"2018-10-28","2018-11-03",{"$f":"IF(AND(H52>='A - Contractor Summary'!$C$36,I52<='A - Contractor Summary'!$C$42),\"Yes\",\"No\")","v":"No"},{"$f":"VLOOKUP($C52,'C.1 - Rate Sheets'!H:I,2,FALSE)","v":2.09},null,null,null,null,null,null,null,{"$f":"327/7","v":46.714285714285715},{"$f":"327/7","v":46.714285714285715},46.714285714285715,46.714285714285715,46.714285714285715,46.714285714285715,46.714285714285715,327,683.43,683.43,0,0,0]
[null,33,"Pick-Up",null,"Vendor No.01","Crew#2",362735,"2018-10-28","2018-11-03",{"$f":"IF(AND(H53>='A - Contractor Summary'!$C$36,I53<='A - Contractor Summary'!$C$42),\"Yes\",\"No\")","v":"No"},{"$f":"VLOOKUP($C53,'C.1 - Rate Sheets'!H:I,2,FALSE)","v":28.75},null,null,null,null,null,null,null,{"$f":"70/7","v":10},{"$f":"70/7","v":10},10,10,10,10,10,70,2012.5,2012.5,0,0,0]
[null,34,"Mobilization on Equipment (1 ton or less)",null,"Vendor No.01","Crew#2",362735,"2018-10-28","2018-11-03",{"$f":"IF(AND(H54>='A - Contractor Summary'!$C$36,I54<='A - Contractor Summary'!$C$42),\"Yes\",\"No\")","v":"No"},{"$f":"VLOOKUP($C54,'C.1 - Rate Sheets'!H:I,2,FALSE)","v":2.09},null,null,null,null,null,null,null,{"$f":"336/7","v":48},{"$f":"336/7","v":48},48,48,48,48,48,336,702.24,702.24,0,0,0]
[null,35,"Mobilization on Equipment (1 ton or less)",null,"Vendor No.01","Crew#2",362735,"2018-10-28","2018-11-03",{"$f":"IF(AND(H55>='A - Contractor Summary'!$C$36,I55<='A - Contractor Summary'!$C$42),\"Yes\",\"No\")","v":"No"},{"$f":"VLOOKUP($C55,'C.1 - Rate Sheets'!H:I,2,FALSE)","v":2.09},null,null,null,null,null,null,null,{"$f":"327/7","v":46.714285714285715},{"$f":"327/7","v":46.714285714285715},46.714285714285715,46.714285714285715,46.714285714285715,46.714285714285715,46.714285714285715,327,683.43,683.43,0,0,0]
[null,36,"55' Lift",null,"Vendor No.01","Crew#2",362735,"2018-10-28","2018-11-03",{"$f":"IF(AND(H56>='A - Contractor Summary'!$C$36,I56<='A - Contractor Summary'!$C$42),\"Yes\",\"No\")","v":"No"},{"$f":"VLOOKUP($C56,'C.1 - Rate Sheets'!H:I,2,FALSE)","v":44.28},null,null,null,null,null,null,null,{"$f":"70/7","v":10},{"$f":"70/7","v":10},10,10,10,10,10,70,3099.6,3099.6,0,0,0]
[null,37,"Mobilization on Equipment (More than 1 ton)",null,"Vendor No.01","Crew#2",362735,"2018-10-28","2018-11-03",{"$f":"IF(AND(H57>='A - Contractor Summary'!$C$36,I57<='A - Contractor Summary'!$C$42),\"Yes\",\"No\")","v":"No"},{"$f":"VLOOKUP($C57,'C.1 - Rate Sheets'!H:I,2,FALSE)","v":2.78},null,null,null,null,null,null,null,{"$f":"336/7","v":48},{"$f":"336/7","v":48},48,48,48,48,48,336,934.07999999999993,934.07999999999993,0,0,0]
[null,38,"Mobilization on Equipment (More than 1 ton)",null,"Vendor No.01","Crew#2",362735,"2018-10-28","2018-11-03",{"$f":"IF(AND(H58>='A - Contractor Summary'!$C$36,I58<='A - Contractor Summary'!$C$42),\"Yes\",\"No\")","v":"No"},{"$f":"VLOOKUP($C58,'C.1 - Rate Sheets'!H:I,2,FALSE)","v":2.78},null,null,null,null,null,null,null,{"$f":"327/7","v":46.714285714285715},{"$f":"327/7","v":46.714285714285715},46.714285714285715,46.714285714285715,46.714285714285715,46.714285714285715,46.714285714285715,327,909.06,909.06,0,0,0]
[null,39,"Pick-Up",null,"Vendor No.01","Crew#2",362735,"2018-10-28","2018-11-03",{"$f":"IF(AND(H59>='A - Contractor Summary'!$C$36,I59<='A - Contractor Summary'!$C$42),\"Yes\",\"No\")","v":"No"},{"$f":"VLOOKUP($C59,'C.1 - Rate Sheets'!H:I,2,FALSE)","v":28.75},null,null,null,null,null,null,null,{"$f":"70/7","v":10},{"$f":"70/7","v":10},10,10,10,10,10,70,2012.5,2012.5,0,0,0]
[null,40,"Mobilization on Equipment (1 ton or less)",null,"Vendor No.01","Crew#2",362735,"2018-10-28","2018-11-03",{"$f":"IF(AND(H60>='A - Contractor Summary'!$C$36,I60<='A - Contractor Summary'!$C$42),\"Yes\",\"No\")","v":"No"},{"$f":"VLOOKUP($C60,'C.1 - Rate Sheets'!H:I,2,FALSE)","v":2.09},null,null,null,null,null,null,null,{"$f":"336/7","v":48},{"$f":"336/7","v":48},48,48,48,48,48,336,702.24,702.24,0,0,0]
[null,41,"Mobilization on Equipment (1 ton or less)",null,"Vendor No.01","Crew#2",362735,"2018-10-28","2018-11-03",{"$f":"IF(AND(H61>='A - Contractor Summary'!$C$36,I61<='A - Contractor Summary'!$C$42),\"Yes\",\"No\")","v":"No"},{"$f":"VLOOKUP($C61,'C.1 - Rate Sheets'!H:I,2,FALSE)","v":2.09},null,null,null,null,null,null,null,{"$f":"327/7","v":46.714285714285715},{"$f":"327/7","v":46.714285714285715},46.714285714285715,46.714285714285715,46.714285714285715,46.714285714285715,46.714285714285715,327,683.43,683.43,0,0,0]
[null,42,null,null,null,null,null,null,null,null,null,null,null,null,null,null,null,null,null,null,null,null,null,null,null,0,0,0,0,0,0]
[null,43,null,null,null,null,null,null,null,null,null,null,null,null,null,null,null,null,null,null,null,null,null,null,null,0,0,0,0,0,0]
[null,null,null,null,null,null,null,null,null,null,null,{"$f":"SUM(L18:L63)","v":809.71428571428578},809.71428571428578,809.71428571428578,809.71428571428578,809.71428571428578,809.71428571428578,809.71428571428578,800.85714285714278,800.85714285714278,800.85714285714278,800.85714285714278,800.85714285714278,800.85714285714278,800.85714285714278,11274,{"$f":"IFERROR(SUM(AA18:AA63),0)","v":60241.259999999987},{"$f":"IFERROR(SUM(AB18:AB63),0)","v":60241.259999999987},{"$f":"SUM(AC18:AC63)","v":0},{"$f":"SUM(AD18:AD63)","v":0},{"$f":"SUM(AE18:AE63)","v":0},{"$f":"AC64-AD64-AE64","v":0},"check (b)"]
[]
[]
[null,null,null,null,null,null,null,null,null,null,null,null,null,null,null,null,null,null,null,null,null,null,null,null,null," "]
[null,"Tickmark Explanation:",null,null,null,null,null,null,null,null,null,null,null,null,null,null,null,null,null,null,null,null,null,null,null,null,null,null,null,35466.9]
[null,null,null,null,null,null,null,null,null,null,null,null,null,null,null,null,null,null,null,null,null,null,null,null,null,null,null,null,null,60241.26]
[null,null,null,null,null,null,null,null,null,null,null,null,null,null,null,null,null,null,null,null,null,null,null,null,null,null,null,null,null,{"$f":"+AD68-AD69","v":-24774.36}]

{"sheet":"D - Lodging","index":8,"n_rows":100,"n_cols":25,"rows_kept":100,"cut":false,"hidden":false,"merged":[[1,1,1,23],[11,15,11,23],[11,1,11,14],[3,1,6,14]]}
[]
[null,"Lodging Charges"]
[]
[null,"Test Plan:  (A) Obtain support of individual charges. (B) Enter Yes/No if receipt is itemized (C) Enter Yes/No if proof of payment has been provided. (D) Ensure charges fall between the dates the vendor was mobilized and the date they arrived.  (E) Ensure charges are prior to the date the vendor arrived home or was released to another utility.  (F) Ensure the location of stay was reasonable (G) Determine the amount(s) to be reviewed, allowed and/or disallowed.  (H) For charges which required further review, document review (include why it was determined to be allowed/disallowed via a tickmark)."]
[]
[]
[]
[null,"Rx","Recalculated."]
[null,"a","Check figure should equal $0.  Cell will appear yellow if discrepancies are noted."]
[]
[null,null,"A",null,null,null,null,null,null,null,null,null,"Rx","B","C","D","E","F","G",null,null,"H"]
[null,"Support Reviewed",null,null,null,null,null,null,null,null,null,null,null,null,null,"Conclusion"]
[null,"#","Type of Support","Support Identifier","Crew","Company","Check In Date","Person","Hotel Name","Location","# of Nights","Total Invoice","$ / Night","Itemized Receipt","Proof of Payment","Reasonable based on Mobilization date(s)","Reasonable based on Demobilization date(s)","Location Reasonable","Conclusion","$ Allowable Charge","$ To Be Reviewed","Reviewed - Allowable $","Reviewed - Unallowable $","Tickmark"]
[null,1,null,null,null,null,null,null,null,null,null,null,{"$f":"L14/K14","v":{"$error":"#DIV/0!"}},null,null,{"$f":"IF(AND(G14>='A - Contractor Summary'!$C$36,G14<='A - Contractor Summary'!$C$38),\"Yes\",IF(G14<'A - Contractor Summary'!$C$36,\"No\",IF(G14>'A - Contractor Summary'!$C$39,\"\",\"\")))","v":"No"},{"$f":"IF(OR(P14=\"Yes\",P14=\"No\")*AND(G14<'A - Contractor Summary'!$C$39),\"\",IF(AND(G14>'A - Contractor Summary'!$C$39,G14<'A - Contractor Summary'!$C$42),\"Yes\",IF(G14>'A - Contractor Summary'!$C$42,\"No\",\"Needs Review\")))","v":""},null,{"$f":"IF(AND(R14=\"YES\",O14=\"Yes\",N14=\"Yes\")*OR(P14=\"Yes\",Q14=\"Yes\"),\"Yes\",IF(OR(N14=\"No\",O14=\"No\",P14=\"No\",Q14=\"No\",R14=\"No\"),\"No\",\"Needs Review\"))","v":"No"},{"$f":"IF(S14=\"Yes\",L14,0)","v":0},{"$f":"IF(S14=\"Needs Review\",L14,0)","v":0}]
[null,2,null,null,null,null,null,null,null,null,null,null,{"$error":"#DIV/0!"},null,null,{"$f":"IF(AND(G15>='A - Contractor Summary'!$C$36,G15<='A - Contractor Summary'!$C$38),\"Yes\",IF(G15<'A - Contractor Summary'!$C$36,\"No\",IF(G15>'A - Contractor Summary'!$C$39,\"\",\"\")))","v":"No"},{"$f":"IF(OR(P15=\"Yes\",P15=\"No\")*AND(G15<'A - Contractor Summary'!$C$39),\"\",IF(AND(G15>'A - Contractor Summary'!$C$39,G15<'A - Contractor Summary'!$C$42),\"Yes\",IF(G15>'A - Contractor Summary'!$C$42,\"No\",\"Needs Review\")))","v":""},null,"No",0,0]
[null,3,null,null,null,null,null,null,null,null,null,null,{"$error":"#DIV/0!"},null,null,{"$f":"IF(AND(G16>='A - Contractor Summary'!$C$36,G16<='A - Contractor Summary'!$C$38),\"Yes\",IF(G16<'A - Contractor Summary'!$C$36,\"No\",IF(G16>'A - Contractor Summary'!$C$39,\"\",\"\")))","v":"No"},{"$f":"IF(OR(P16=\"Yes\",P16=\"No\")*AND(G16<'A - Contractor Summary'!$C$39),\"\",IF(AND(G16>'A - Contractor Summary'!$C$39,G16<'A - Contractor Summary'!$C$42),\"Yes\",IF(G16>'A - Contractor Summary'!$C$42,\"No\",\"Needs Review\")))","v":""},null,"No",0,0]
[null,4,null,null,null,null,null,null,null,null,null,null,{"$error":"#DIV/0!"},null,null,{"$f":"IF(AND(G17>='A - Contractor Summary'!$C$36,G17<='A - Contractor Summary'!$C$38),\"Yes\",IF(G17<'A - Contractor Summary'!$C$36,\"No\",IF(G17>'A - Contractor Summary'!$C$39,\"\",\"\")))","v":"No"},{"$f":"IF(OR(P17=\"Yes\",P17=\"No\")*AND(G17<'A - Contractor Summary'!$C$39),\"\",IF(AND(G17>'A - Contractor Summary'!$C$39,G17<'A - Contractor Summary'!$C$42),\"Yes\",IF(G17>'A - Contractor Summary'!$C$42,\"No\",\"Needs Review\")))","v":""},null,"No",0,0]
[null,5,null,null,null,null,null,null,null,null,null,null,{"$error":"#DIV/0!"},null,null,{"$f":"IF(AND(G18>='A - Contractor Summary'!$C$36,G18<='A - Contractor Summary'!$C$38),\"Yes\",IF(G18<'A - Contractor Summary'!$C$36,\"No\",IF(G18>'A - Contractor Summary'!$C$39,\"\",\"\")))","v":"No"},{"$f":"IF(OR(P18=\"Yes\",P18=\"No\")*AND(G18<'A - Contractor Summary'!$C$39),\"\",IF(AND(G18>'A - Contractor Summary'!$C$39,G18<'A - Contractor Summary'!$C$42),\"Yes\",IF(G18>'A - Contractor Summary'!$C$42,\"No\",\"Needs Review\")))","v":""},null,"No",0,0]
[null,6,null,null,null,null,null,null,null,null,null,null,{"$error":"#DIV/0!"},null,null,{"$f":"IF(AND(G19>='A - Contractor Summary'!$C$36,G19<='A - Contractor Summary'!$C$38),\"Yes\",IF(G19<'A - Contractor Summary'!$C$36,\"No\",IF(G19>'A - Contractor Summary'!$C$39,\"\",\"\")))","v":"No"},{"$f":"IF(OR(P19=\"Yes\",P19=\"No\")*AND(G19<'A - Contractor Summary'!$C$39),\"\",IF(AND(G19>'A - Contractor Summary'!$C$39,G19<'A - Contractor Summary'!$C$42),\"Yes\",IF(G19>'A - Contractor Summary'!$C$42,\"No\",\"Needs Review\")))","v":""},null,"No",0,0]
[null,7,null,null,null,null,null,null,null,null,null,null,{"$error":"#DIV/0!"},null,null,{"$f":"IF(AND(G20>='A - Contractor Summary'!$C$36,G20<='A - Contractor Summary'!$C$38),\"Yes\",IF(G20<'A - Contractor Summary'!$C$36,\"No\",IF(G20>'A - Contractor Summary'!$C$39,\"\",\"\")))","v":"No"},{"$f":"IF(OR(P20=\"Yes\",P20=\"No\")*AND(G20<'A - Contractor Summary'!$C$39),\"\",IF(AND(G20>'A - Contractor Summary'!$C$39,G20<'A - Contractor Summary'!$C$42),\"Yes\",IF(G20>'A - Contractor Summary'!$C$42,\"No\",\"Needs Review\")))","v":""},null,"No",0,0]
[null,8,null,null,null,null,null,null,null,null,null,null,{"$error":"#DIV/0!"},null,null,{"$f":"IF(AND(G21>='A - Contractor Summary'!$C$36,G21<='A - Contractor Summary'!$C$38),\"Yes\",IF(G21<'A - Contractor Summary'!$C$36,\"No\",IF(G21>'A - Contractor Summary'!$C$39,\"\",\"\")))","v":"No"},{"$f":"IF(OR(P21=\"Yes\",P21=\"No\")*AND(G21<'A - Contractor Summary'!$C$39),\"\",IF(AND(G21>'A - Contractor Summary'!$C$39,G21<'A - Contractor Summary'!$C$42),\"Yes\",IF(G21>'A - Contractor Summary'!$C$42,\"No\",\"Needs Review\")))","v":""},null,"No",0,0]
[null,9,null,null,null,null,null,null,null,null,null,null,{"$error":"#DIV/0!"},null,null,{"$f":"IF(AND(G22>='A - Contractor Summary'!$C$36,G22<='A - Contractor Summary'!$C$38),\"Yes\",IF(G22<'A - Contractor Summary'!$C$36,\"No\",IF(G22>'A - Contractor Summary'!$C$39,\"\",\"\")))","v":"No"},{"$f":"IF(OR(P22=\"Yes\",P22=\"No\")*AND(G22<'A - Contractor Summary'!$C$39),\"\",IF(AND(G22>'A - Contractor Summary'!$C$39,G22<'A - Contractor Summary'!$C$42),\"Yes\",IF(G22>'A - Contractor Summary'!$C$42,\"No\",\"Needs Review\")))","v":""},null,"No",0,0]
[null,10,null,null,null,null,null,null,null,null,null,null,{"$error":"#DIV/0!"},null,null,{"$f":"IF(AND(G23>='A - Contractor Summary'!$C$36,G23<='A - Contractor Summary'!$C$38),\"Yes\",IF(G23<'A - Contractor Summary'!$C$36,\"No\",IF(G23>'A - Contractor Summary'!$C$39,\"\",\"\")))","v":"No"},{"$f":"IF(OR(P23=\"Yes\",P23=\"No\")*AND(G23<'A - Contractor Summary'!$C$39),\"\",IF(AND(G23>'A - Contractor Summary'!$C$39,G23<'A - Contractor Summary'!$C$42),\"Yes\",IF(G23>'A - Contractor Summary'!$C$42,\"No\",\"Needs Review\")))","v":""},null,"No",0,0]
[null,11,null,null,null,null,null,null,null,null,null,null,{"$error":"#DIV/0!"},null,null,{"$f":"IF(AND(G24>='A - Contractor Summary'!$C$36,G24<='A - Contractor Summary'!$C$38),\"Yes\",IF(G24<'A - Contractor Summary'!$C$36,\"No\",IF(G24>'A - Contractor Summary'!$C$39,\"\",\"\")))","v":"No"},{"$f":"IF(OR(P24=\"Yes\",P24=\"No\")*AND(G24<'A - Contractor Summary'!$C$39),\"\",IF(AND(G24>'A - Contractor Summary'!$C$39,G24<'A - Contractor Summary'!$C$42),\"Yes\",IF(G24>'A - Contractor Summary'!$C$42,\"No\",\"Needs Review\")))","v":""},null,"No",0,0]
[null,12,null,null,null,null,null,null,null,null,null,null,{"$error":"#DIV/0!"},null,null,{"$f":"IF(AND(G25>='A - Contractor Summary'!$C$36,G25<='A - Contractor Summary'!$C$38),\"Yes\",IF(G25<'A - Contractor Summary'!$C$36,\"No\",IF(G25>'A - Contractor Summary'!$C$39,\"\",\"\")))","v":"No"},{"$f":"IF(OR(P25=\"Yes\",P25=\"No\")*AND(G25<'A - Contractor Summary'!$C$39),\"\",IF(AND(G25>'A - Contractor Summary'!$C$39,G25<'A - Contractor Summary'!$C$42),\"Yes\",IF(G25>'A - Contractor Summary'!$C$42,\"No\",\"Needs Review\")))","v":""},null,"No",0,0]
[null,13,null,null,null,null,null,null,null,null,null,null,{"$error":"#DIV/0!"},null,null,{"$f":"IF(AND(G26>='A - Contractor Summary'!$C$36,G26<='A - Contractor Summary'!$C$38),\"Yes\",IF(G26<'A - Contractor Summary'!$C$36,\"No\",IF(G26>'A - Contractor Summary'!$C$39,\"\",\"\")))","v":"No"},{"$f":"IF(OR(P26=\"Yes\",P26=\"No\")*AND(G26<'A - Contractor Summary'!$C$39),\"\",IF(AND(G26>'A - Contractor Summary'!$C$39,G26<'A - Contractor Summary'!$C$42),\"Yes\",IF(G26>'A - Contractor Summary'!$C$42,\"No\",\"Needs Review\")))","v":""},null,"No",0,0]
[null,14,null,null,null,null,null,null,null,null,null,null,{"$error":"#DIV/0!"},null,null,{"$f":"IF(AND(G27>='A - Contractor Summary'!$C$36,G27<='A - Contractor Summary'!$C$38),\"Yes\",IF(G27<'A - Contractor Summary'!$C$36,\"No\",IF(G27>'A - Contractor Summary'!$C$39,\"\",\"\")))","v":"No"},{"$f":"IF(OR(P27=\"Yes\",P27=\"No\")*AND(G27<'A - Contractor Summary'!$C$39),\"\",IF(AND(G27>'A - Contractor Summary'!$C$39,G27<'A - Contractor Summary'!$C$42),\"Yes\",IF(G27>'A - Contractor Summary'!$C$42,\"No\",\"Needs Review\")))","v":""},null,"No",0,0]
[null,15,null,null,null,null,null,null,null,null,null,null,{"$error":"#DIV/0!"},null,null,{"$f":"IF(AND(G28>='A - Contractor Summary'!$C$36,G28<='A - Contractor Summary'!$C$38),\"Yes\",IF(G28<'A - Contractor Summary'!$C$36,\"No\",IF(G28>'A - Contractor Summary'!$C$39,\"\",\"\")))","v":"No"},{"$f":"IF(OR(P28=\"Yes\",P28=\"No\")*AND(G28<'A - Contractor Summary'!$C$39),\"\",IF(AND(G28>'A - Contractor Summary'!$C$39,G28<'A - Contractor Summary'!$C$42),\"Yes\",IF(G28>'A - Contractor Summary'!$C$42,\"No\",\"Needs Review\")))","v":""},null,"No",0,0]
[null,16,null,null,null,null,null,null,null,null,null,null,{"$error":"#DIV/0!"},null,null,{"$f":"IF(AND(G29>='A - Contractor Summary'!$C$36,G29<='A - Contractor Summary'!$C$38),\"Yes\",IF(G29<'A - Contractor Summary'!$C$36,\"No\",IF(G29>'A - Contractor Summary'!$C$39,\"\",\"\")))","v":"No"},{"$f":"IF(OR(P29=\"Yes\",P29=\"No\")*AND(G29<'A - Contractor Summary'!$C$39),\"\",IF(AND(G29>'A - Contractor Summary'!$C$39,G29<'A - Contractor Summary'!$C$42),\"Yes\",IF(G29>'A - Contractor Summary'!$C$42,\"No\",\"Needs Review\")))","v":""},null,"No",0,0]
[null,17,null,null,null,null,null,null,null,null,null,null,{"$error":"#DIV/0!"},null,null,{"$f":"IF(AND(G30>='A - Contractor Summary'!$C$36,G30<='A - Contractor Summary'!$C$38),\"Yes\",IF(G30<'A - Contractor Summary'!$C$36,\"No\",IF(G30>'A - Contractor Summary'!$C$39,\"\",\"\")))","v":"No"},{"$f":"IF(OR(P30=\"Yes\",P30=\"No\")*AND(G30<'A - Contractor Summary'!$C$39),\"\",IF(AND(G30>'A - Contractor Summary'!$C$39,G30<'A - Contractor Summary'!$C$42),\"Yes\",IF(G30>'A - Contractor Summary'!$C$42,\"No\",\"Needs Review\")))","v":""},null,"No",0,0]
[null,18,null,null,null,null,null,null,null,null,null,null,{"$error":"#DIV/0!"},null,null,{"$f":"IF(AND(G31>='A - Contractor Summary'!$C$36,G31<='A - Contractor Summary'!$C$38),\"Yes\",IF(G31<'A - Contractor Summary'!$C$36,\"No\",IF(G31>'A - Contractor Summary'!$C$39,\"\",\"\")))","v":"No"},{"$f":"IF(OR(P31=\"Yes\",P31=\"No\")*AND(G31<'A - Contractor Summary'!$C$39),\"\",IF(AND(G31>'A - Contractor Summary'!$C$39,G31<'A - Contractor Summary'!$C$42),\"Yes\",IF(G31>'A - Contractor Summary'!$C$42,\"No\",\"Needs Review\")))","v":""},null,"No",0,0]
[null,19,null,null,null,null,null,null,null,null,null,null,{"$error":"#DIV/0!"},null,null,{"$f":"IF(AND(G32>='A - Contractor Summary'!$C$36,G32<='A - Contractor Summary'!$C$38),\"Yes\",IF(G32<'A - Contractor Summary'!$C$36,\"No\",IF(G32>'A - Contractor Summary'!$C$39,\"\",\"\")))","v":"No"},{"$f":"IF(OR(P32=\"Yes\",P32=\"No\")*AND(G32<'A - Contractor Summary'!$C$39),\"\",IF(AND(G32>'A - Contractor Summary'!$C$39,G32<'A - Contractor Summary'!$C$42),\"Yes\",IF(G32>'A - Contractor Summary'!$C$42,\"No\",\"Needs Review\")))","v":""},null,"No",0,0]
[null,20,null,null,null,null,null,null,null,null,null,null,{"$error":"#DIV/0!"},null,null,{"$f":"IF(AND(G33>='A - Contractor Summary'!$C$36,G33<='A - Contractor Summary'!$C$38),\"Yes\",IF(G33<'A - Contractor Summary'!$C$36,\"No\",IF(G33>'A - Contractor Summary'!$C$39,\"\",\"\")))","v":"No"},{"$f":"IF(OR(P33=\"Yes\",P33=\"No\")*AND(G33<'A - Contractor Summary'!$C$39),\"\",IF(AND(G33>'A - Contractor Summary'!$C$39,G33<'A - Contractor Summary'!$C$42),\"Yes\",IF(G33>'A - Contractor Summary'!$C$42,\"No\",\"Needs Review\")))","v":""},null,"No",0,0]
[null,21,null,null,null,null,null,null,null,null,null,null,{"$error":"#DIV/0!"},null,null,{"$f":"IF(AND(G34>='A - Contractor Summary'!$C$36,G34<='A - Contractor Summary'!$C$38),\"Yes\",IF(G34<'A - Contractor Summary'!$C$36,\"No\",IF(G34>'A - Contractor Summary'!$C$39,\"\",\"\")))","v":"No"},{"$f":"IF(OR(P34=\"Yes\",P34=\"No\")*AND(G34<'A - Contractor Summary'!$C$39),\"\",IF(AND(G34>'A - Contractor Summary'!$C$39,G34<'A - Contractor Summary'!$C$42),\"Yes\",IF(G34>'A - Contractor Summary'!$C$42,\"No\",\"Needs Review\")))","v":""},null,"No",0,0]
[null,22,null,null,null,null,null,null,null,null,null,null,{"$error":"#DIV/0!"},null,null,{"$f":"IF(AND(G35>='A - Contractor Summary'!$C$36,G35<='A - Contractor Summary'!$C$38),\"Yes\",IF(G35<'A - Contractor Summary'!$C$36,\"No\",IF(G35>'A - Contractor Summary'!$C$39,\"\",\"\")))","v":"No"},{"$f":"IF(OR(P35=\"Yes\",P35=\"No\")*AND(G35<'A - Contractor Summary'!$C$39),\"\",IF(AND(G35>'A - Contractor Summary'!$C$39,G35<'A - Contractor Summary'!$C$42),\"Yes\",IF(G35>'A - Contractor Summary'!$C$42,\"No\",\"Needs Review\")))","v":""},null,"No",0,0]
[null,23,null,null,null,null,null,null,null,null,null,null,{"$error":"#DIV/0!"},null,null,{"$f":"IF(AND(G36>='A - Contractor Summary'!$C$36,G36<='A - Contractor Summary'!$C$38),\"Yes\",IF(G36<'A - Contractor Summary'!$C$36,\"No\",IF(G36>'A - Contractor Summary'!$C$39,\"\",\"\")))","v":"No"},{"$f":"IF(OR(P36=\"Yes\",P36=\"No\")*AND(G36<'A - Contractor Summary'!$C$39),\"\",IF(AND(G36>'A - Contractor Summary'!$C$39,G36<'A - Contractor Summary'!$C$42),\"Yes\",IF(G36>'A - Contractor Summary'!$C$42,\"No\",\"Needs Review\")))","v":""},null,"No",0,0]
[null,24,null,null,null,null,null,null,null,null,null,null,{"$error":"#DIV/0!"},null,null,{"$f":"IF(AND(G37>='A - Contractor Summary'!$C$36,G37<='A - Contractor Summary'!$C$38),\"Yes\",IF(G37<'A - Contractor Summary'!$C$36,\"No\",IF(G37>'A - Contractor Summary'!$C$39,\"\",\"\")))","v":"No"},{"$f":"IF(OR(P37=\"Yes\",P37=\"No\")*AND(G37<'A - Contractor Summary'!$C$39),\"\",IF(AND(G37>'A - Contractor Summary'!$C$39,G37<'A - Contractor Summary'!$C$42),\"Yes\",IF(G37>'A - Contractor Summary'!$C$42,\"No\",\"Needs Review\")))","v":""},null,"No",0,0]
[null,25,null,null,null,null,null,null,null,null,null,null,{"$error":"#DIV/0!"},null,null,{"$f":"IF(AND(G38>='A - Contractor Summary'!$C$36,G38<='A - Contractor Summary'!$C$38),\"Yes\",IF(G38<'A - Contractor Summary'!$C$36,\"No\",IF(G38>'A - Contractor Summary'!$C$39,\"\",\"\")))","v":"No"},{"$f":"IF(OR(P38=\"Yes\",P38=\"No\")*AND(G38<'A - Contractor Summary'!$C$39),\"\",IF(AND(G38>'A - Contractor Summary'!$C$39,G38<'A - Contractor Summary'!$C$42),\"Yes\",IF(G38>'A - Contractor Summary'!$C$42,\"No\",\"Needs Review\")))","v":""},null,"No",0,0]
[null,26,null,null,null,null,null,null,null,null,null,null,{"$error":"#DIV/0!"},null,null,{"$f":"IF(AND(G39>='A - Contractor Summary'!$C$36,G39<='A - Contractor Summary'!$C$38),\"Yes\",IF(G39<'A - Contractor Summary'!$C$36,\"No\",IF(G39>'A - Contractor Summary'!$C$39,\"\",\"\")))","v":"No"},{"$f":"IF(OR(P39=\"Yes\",P39=\"No\")*AND(G39<'A - Contractor Summary'!$C$39),\"\",IF(AND(G39>'A - Contractor Summary'!$C$39,G39<'A - Contractor Summary'!$C$42),\"Yes\",IF(G39>'A - Contractor Summary'!$C$42,\"No\",\"Needs Review\")))","v":""},null,"No",0,0]
[null,27,null,null,null,null,null,null,null,null,null,null,{"$error":"#DIV/0!"},null,null,{"$f":"IF(AND(G40>='A - Contractor Summary'!$C$36,G40<='A - Contractor Summary'!$C$38),\"Yes\",IF(G40<'A - Contractor Summary'!$C$36,\"No\",IF(G40>'A - Contractor Summary'!$C$39,\"\",\"\")))","v":"No"},{"$f":"IF(OR(P40=\"Yes\",P40=\"No\")*AND(G40<'A - Contractor Summary'!$C$39),\"\",IF(AND(G40>'A - Contractor Summary'!$C$39,G40<'A - Contractor Summary'!$C$42),\"Yes\",IF(G40>'A - Contractor Summary'!$C$42,\"No\",\"Needs Review\")))","v":""},null,"No",0,0]
[null,28,null,null,null,null,null,null,null,null,null,null,{"$error":"#DIV/0!"},null,null,{"$f":"IF(AND(G41>='A - Contractor Summary'!$C$36,G41<='A - Contractor Summary'!$C$38),\"Yes\",IF(G41<'A - Contractor Summary'!$C$36,\"No\",IF(G41>'A - Contractor Summary'!$C$39,\"\",\"\")))","v":"No"},{"$f":"IF(OR(P41=\"Yes\",P41=\"No\")*AND(G41<'A - Contractor Summary'!$C$39),\"\",IF(AND(G41>'A - Contractor Summary'!$C$39,G41<'A - Contractor Summary'!$C$42),\"Yes\",IF(G41>'A - Contractor Summary'!$C$42,\"No\",\"Needs Review\")))","v":""},null,"No",0,0]
[null,29,null,null,null,null,null,null,null,null,null,null,{"$error":"#DIV/0!"},null,null,{"$f":"IF(AND(G42>='A - Contractor Summary'!$C$36,G42<='A - Contractor Summary'!$C$38),\"Yes\",IF(G42<'A - Contractor Summary'!$C$36,\"No\",IF(G42>'A - Contractor Summary'!$C$39,\"\",\"\")))","v":"No"},{"$f":"IF(OR(P42=\"Yes\",P42=\"No\")*AND(G42<'A - Contractor Summary'!$C$39),\"\",IF(AND(G42>'A - Contractor Summary'!$C$39,G42<'A - Contractor Summary'!$C$42),\"Yes\",IF(G42>'A - Contractor Summary'!$C$42,\"No\",\"Needs Review\")))","v":""},null,"No",0,0]
[null,30,null,null,null,null,null,null,null,null,null,null,{"$error":"#DIV/0!"},null,null,{"$f":"IF(AND(G43>='A - Contractor Summary'!$C$36,G43<='A - Contractor Summary'!$C$38),\"Yes\",IF(G43<'A - Contractor Summary'!$C$36,\"No\",IF(G43>'A - Contractor Summary'!$C$39,\"\",\"\")))","v":"No"},{"$f":"IF(OR(P43=\"Yes\",P43=\"No\")*AND(G43<'A - Contractor Summary'!$C$39),\"\",IF(AND(G43>'A - Contractor Summary'!$C$39,G43<'A - Contractor Summary'!$C$42),\"Yes\",IF(G43>'A - Contractor Summary'!$C$42,\"No\",\"Needs Review\")))","v":""},null,"No",0,0]
[null,31,null,null,null,null,null,null,null,null,null,null,{"$error":"#DIV/0!"},null,null,{"$f":"IF(AND(G44>='A - Contractor Summary'!$C$36,G44<='A - Contractor Summary'!$C$38),\"Yes\",IF(G44<'A - Contractor Summary'!$C$36,\"No\",IF(G44>'A - Contractor Summary'!$C$39,\"\",\"\")))","v":"No"},{"$f":"IF(OR(P44=\"Yes\",P44=\"No\")*AND(G44<'A - Contractor Summary'!$C$39),\"\",IF(AND(G44>'A - Contractor Summary'!$C$39,G44<'A - Contractor Summary'!$C$42),\"Yes\",IF(G44>'A - Contractor Summary'!$C$42,\"No\",\"Needs Review\")))","v":""},null,"No",0,0]
[null,32,null,null,null,null,null,null,null,null,null,null,{"$error":"#DIV/0!"},null,null,{"$f":"IF(AND(G45>='A - Contractor Summary'!$C$36,G45<='A - Contractor Summary'!$C$38),\"Yes\",IF(G45<'A - Contractor Summary'!$C$36,\"No\",IF(G45>'A - Contractor Summary'!$C$39,\"\",\"\")))","v":"No"},{"$f":"IF(OR(P45=\"Yes\",P45=\"No\")*AND(G45<'A - Contractor Summary'!$C$39),\"\",IF(AND(G45>'A - Contractor Summary'!$C$39,G45<'A - Contractor Summary'!$C$42),\"Yes\",IF(G45>'A - Contractor Summary'!$C$42,\"No\",\"Needs Review\")))","v":""},null,"No",0,0]
[null,33,null,null,null,null,null,null,null,null,null,null,{"$f":"L46/K46","v":{"$error":"#DIV/0!"}},null,null,{"$f":"IF(AND(G46>='A - Contractor Summary'!$C$36,G46<='A - Contractor Summary'!$C$38),\"Yes\",IF(G46<'A - Contractor Summary'!$C$36,\"No\",IF(G46>'A - Contractor Summary'!$C$39,\"\",\"\")))","v":"No"},{"$f":"IF(OR(P46=\"Yes\",P46=\"No\")*AND(G46<'A - Contractor Summary'!$C$39),\"\",IF(AND(G46>'A - Contractor Summary'!$C$39,G46<'A - Contractor Summary'!$C$42),\"Yes\",IF(G46>'A - Contractor Summary'!$C$42,\"No\",\"Needs Review\")))","v":""},null,{"$f":"IF(AND(R46=\"YES\",O46=\"Yes\",N46=\"Yes\")*OR(P46=\"Yes\",Q46=\"Yes\"),\"Yes\",IF(OR(N46=\"No\",O46=\"No\",P46=\"No\",Q46=\"No\",R46=\"No\"),\"No\",\"Needs Review\"))","v":"No"},{"$f":"IF(S46=\"Yes\",L46,0)","v":0},{"$f":"IF(S46=\"Needs Review\",L46,0)","v":0}]
[null,34,null,null,null,null,null,null,null,null,null,null,{"$error":"#DIV/0!"},null,null,{"$f":"IF(AND(G47>='A - Contractor Summary'!$C$36,G47<='A - Contractor Summary'!$C$38),\"Yes\",IF(G47<'A - Contractor Summary'!$C$36,\"No\",IF(G47>'A - Contractor Summary'!$C$39,\"\",\"\")))","v":"No"},{"$f":"IF(OR(P47=\"Yes\",P47=\"No\")*AND(G47<'A - Contractor Summary'!$C$39),\"\",IF(AND(G47>'A - Contractor Summary'!$C$39,G47<'A - Contractor Summary'!$C$42),\"Yes\",IF(G47>'A - Contractor Summary'!$C$42,\"No\",\"Needs Review\")))","v":""},null,"No",0,0]
[null,35,null,null,null,null,null,null,null,null,null,null,{"$error":"#DIV/0!"},null,null,{"$f":"IF(AND(G48>='A - Contractor Summary'!$C$36,G48<='A - Contractor Summary'!$C$38),\"Yes\",IF(G48<'A - Contractor Summary'!$C$36,\"No\",IF(G48>'A - Contractor Summary'!$C$39,\"\",\"\")))","v":"No"},{"$f":"IF(OR(P48=\"Yes\",P48=\"No\")*AND(G48<'A - Contractor Summary'!$C$39),\"\",IF(AND(G48>'A - Contractor Summary'!$C$39,G48<'A - Contractor Summary'!$C$42),\"Yes\",IF(G48>'A - Contractor Summary'!$C$42,\"No\",\"Needs Review\")))","v":""},null,"No",0,0]
[null,36,null,null,null,null,null,null,null,null,null,null,{"$error":"#DIV/0!"},null,null,{"$f":"IF(AND(G49>='A - Contractor Summary'!$C$36,G49<='A - Contractor Summary'!$C$38),\"Yes\",IF(G49<'A - Contractor Summary'!$C$36,\"No\",IF(G49>'A - Contractor Summary'!$C$39,\"\",\"\")))","v":"No"},{"$f":"IF(OR(P49=\"Yes\",P49=\"No\")*AND(G49<'A - Contractor Summary'!$C$39),\"\",IF(AND(G49>'A - Contractor Summary'!$C$39,G49<'A - Contractor Summary'!$C$42),\"Yes\",IF(G49>'A - Contractor Summary'!$C$42,\"No\",\"Needs Review\")))","v":""},null,"No",0,0]
[null,37,null,null,null,null,null,null,null,null,null,null,{"$error":"#DIV/0!"},null,null,{"$f":"IF(AND(G50>='A - Contractor Summary'!$C$36,G50<='A - Contractor Summary'!$C$38),\"Yes\",IF(G50<'A - Contractor Summary'!$C$36,\"No\",IF(G50>'A - Contractor Summary'!$C$39,\"\",\"\")))","v":"No"},{"$f":"IF(OR(P50=\"Yes\",P50=\"No\")*AND(G50<'A - Contractor Summary'!$C$39),\"\",IF(AND(G50>'A - Contractor Summary'!$C$39,G50<'A - Contractor Summary'!$C$42),\"Yes\",IF(G50>'A - Contractor Summary'!$C$42,\"No\",\"Needs Review\")))","v":""},null,"No",0,0]
[null,38,null,null,null,null,null,null,null,null,null,null,{"$error":"#DIV/0!"},null,null,{"$f":"IF(AND(G51>='A - Contractor Summary'!$C$36,G51<='A - Contractor Summary'!$C$38),\"Yes\",IF(G51<'A - Contractor Summary'!$C$36,\"No\",IF(G51>'A - Contractor Summary'!$C$39,\"\",\"\")))","v":"No"},{"$f":"IF(OR(P51=\"Yes\",P51=\"No\")*AND(G51<'A - Contractor Summary'!$C$39),\"\",IF(AND(G51>'A - Contractor Summary'!$C$39,G51<'A - Contractor Summary'!$C$42),\"Yes\",IF(G51>'A - Contractor Summary'!$C$42,\"No\",\"Needs Review\")))","v":""},null,"No",0,0]
[null,39,null,null,null,null,null,null,null,null,null,null,{"$error":"#DIV/0!"},null,null,{"$f":"IF(AND(G52>='A - Contractor Summary'!$C$36,G52<='A - Contractor Summary'!$C$38),\"Yes\",IF(G52<'A - Contractor Summary'!$C$36,\"No\",IF(G52>'A - Contractor Summary'!$C$39,\"\",\"\")))","v":"No"},{"$f":"IF(OR(P52=\"Yes\",P52=\"No\")*AND(G52<'A - Contractor Summary'!$C$39),\"\",IF(AND(G52>'A - Contractor Summary'!$C$39,G52<'A - Contractor Summary'!$C$42),\"Yes\",IF(G52>'A - Contractor Summary'!$C$42,\"No\",\"Needs Review\")))","v":""},null,"No",0,0]
[null,40,null,null,null,null,null,null,null,null,null,null,{"$error":"#DIV/0!"},null,null,{"$f":"IF(AND(G53>='A - Contractor Summary'!$C$36,G53<='A - Contractor Summary'!$C$38),\"Yes\",IF(G53<'A - Contractor Summary'!$C$36,\"No\",IF(G53>'A - Contractor Summary'!$C$39,\"\",\"\")))","v":"No"},{"$f":"IF(OR(P53=\"Yes\",P53=\"No\")*AND(G53<'A - Contractor Summary'!$C$39),\"\",IF(AND(G53>'A - Contractor Summary'!$C$39,G53<'A - Contractor Summary'!$C$42),\"Yes\",IF(G53>'A - Contractor Summary'!$C$42,\"No\",\"Needs Review\")))","v":""},null,"No",0,0]
[null,41,null,null,null,null,null,null,null,null,null,null,{"$error":"#DIV/0!"},null,null,{"$f":"IF(AND(G54>='A - Contractor Summary'!$C$36,G54<='A - Contractor Summary'!$C$38),\"Yes\",IF(G54<'A - Contractor Summary'!$C$36,\"No\",IF(G54>'A - Contractor Summary'!$C$39,\"\",\"\")))","v":"No"},{"$f":"IF(OR(P54=\"Yes\",P54=\"No\")*AND(G54<'A - Contractor Summary'!$C$39),\"\",IF(AND(G54>'A - Contractor Summary'!$C$39,G54<'A - Contractor Summary'!$C$42),\"Yes\",IF(G54>'A - Contractor Summary'!$C$42,\"No\",\"Needs Review\")))","v":""},null,"No",0,0]
[null,42,null,null,null,null,null,null,null,null,null,null,{"$error":"#DIV/0!"},null,null,{"$f":"IF(AND(G55>='A - Contractor Summary'!$C$36,G55<='A - Contractor Summary'!$C$38),\"Yes\",IF(G55<'A - Contractor Summary'!$C$36,\"No\",IF(G55>'A - Contractor Summary'!$C$39,\"\",\"\")))","v":"No"},{"$f":"IF(OR(P55=\"Yes\",P55=\"No\")*AND(G55<'A - Contractor Summary'!$C$39),\"\",IF(AND(G55>'A - Contractor Summary'!$C$39,G55<'A - Contractor Summary'!$C$42),\"Yes\",IF(G55>'A - Contractor Summary'!$C$42,\"No\",\"Needs Review\")))","v":""},null,"No",0,0]
[null,43,null,null,null,null,null,null,null,null,null,null,{"$error":"#DIV/0!"},null,null,{"$f":"IF(AND(G56>='A - Contractor Summary'!$C$36,G56<='A - Contractor Summary'!$C$38),\"Yes\",IF(G56<'A - Contractor Summary'!$C$36,\"No\",IF(G56>'A - Contractor Summary'!$C$39,\"\",\"\")))","v":"No"},{"$f":"IF(OR(P56=\"Yes\",P56=\"No\")*AND(G56<'A - Contractor Summary'!$C$39),\"\",IF(AND(G56>'A - Contractor Summary'!$C$39,G56<'A - Contractor Summary'!$C$42),\"Yes\",IF(G56>'A - Contractor Summary'!$C$42,\"No\",\"Needs Review\")))","v":""},null,"No",0,0]
[null,44,null,null,null,null,null,null,null,null,null,null,{"$error":"#DIV/0!"},null,null,{"$f":"IF(AND(G57>='A - Contractor Summary'!$C$36,G57<='A - Contractor Summary'!$C$38),\"Yes\",IF(G57<'A - Contractor Summary'!$C$36,\"No\",IF(G57>'A - Contractor Summary'!$C$39,\"\",\"\")))","v":"No"},{"$f":"IF(OR(P57=\"Yes\",P57=\"No\")*AND(G57<'A - Contractor Summary'!$C$39),\"\",IF(AND(G57>'A - Contractor Summary'!$C$39,G57<'A - Contractor Summary'!$C$42),\"Yes\",IF(G57>'A - Contractor Summary'!$C$42,\"No\",\"Needs Review\")))","v":""},null,"No",0,0]
[null,45,null,null,null,null,null,null,null,null,null,null,{"$error":"#DIV/0!"},null,null,{"$f":"IF(AND(G58>='A - Contractor Summary'!$C$36,G58<='A - Contractor Summary'!$C$38),\"Yes\",IF(G58<'A - Contractor Summary'!$C$36,\"No\",IF(G58>'A - Contractor Summary'!$C$39,\"\",\"\")))","v":"No"},{"$f":"IF(OR(P58=\"Yes\",P58=\"No\")*AND(G58<'A - Contractor Summary'!$C$39),\"\",IF(AND(G58>'A - Contractor Summary'!$C$39,G58<'A - Contractor Summary'!$C$42),\"Yes\",IF(G58>'A - Contractor Summary'!$C$42,\"No\",\"Needs Review\")))","v":""},null,"No",0,0]
[null,46,null,null,null,null,null,null,null,null,null,null,{"$error":"#DIV/0!"},null,null,{"$f":"IF(AND(G59>='A - Contractor Summary'!$C$36,G59<='A - Contractor Summary'!$C$38),\"Yes\",IF(G59<'A - Contractor Summary'!$C$36,\"No\",IF(G59>'A - Contractor Summary'!$C$39,\"\",\"\")))","v":"No"},{"$f":"IF(OR(P59=\"Yes\",P59=\"No\")*AND(G59<'A - Contractor Summary'!$C$39),\"\",IF(AND(G59>'A - Contractor Summary'!$C$39,G59<'A - Contractor Summary'!$C$42),\"Yes\",IF(G59>'A - Contractor Summary'!$C$42,\"No\",\"Needs Review\")))","v":""},null,"No",0,0]
[null,47,null,null,null,null,null,null,null,null,null,null,{"$error":"#DIV/0!"},null,null,{"$f":"IF(AND(G60>='A - Contractor Summary'!$C$36,G60<='A - Contractor Summary'!$C$38),\"Yes\",IF(G60<'A - Contractor Summary'!$C$36,\"No\",IF(G60>'A - Contractor Summary'!$C$39,\"\",\"\")))","v":"No"},{"$f":"IF(OR(P60=\"Yes\",P60=\"No\")*AND(G60<'A - Contractor Summary'!$C$39),\"\",IF(AND(G60>'A - Contractor Summary'!$C$39,G60<'A - Contractor Summary'!$C$42),\"Yes\",IF(G60>'A - Contractor Summary'!$C$42,\"No\",\"Needs Review\")))","v":""},null,"No",0,0]
[null,48,null,null,null,null,null,null,null,null,null,null,{"$error":"#DIV/0!"},null,null,{"$f":"IF(AND(G61>='A - Contractor Summary'!$C$36,G61<='A - Contractor Summary'!$C$38),\"Yes\",IF(G61<'A - Contractor Summary'!$C$36,\"No\",IF(G61>'A - Contractor Summary'!$C$39,\"\",\"\")))","v":"No"},{"$f":"IF(OR(P61=\"Yes\",P61=\"No\")*AND(G61<'A - Contractor Summary'!$C$39),\"\",IF(AND(G61>'A - Contractor Summary'!$C$39,G61<'A - Contractor Summary'!$C$42),\"Yes\",IF(G61>'A - Contractor Summary'!$C$42,\"No\",\"Needs Review\")))","v":""},null,"No",0,0]
[null,49,null,null,null,null,null,null,null,null,null,null,{"$error":"#DIV/0!"},null,null,{"$f":"IF(AND(G62>='A - Contractor Summary'!$C$36,G62<='A - Contractor Summary'!$C$38),\"Yes\",IF(G62<'A - Contractor Summary'!$C$36,\"No\",IF(G62>'A - Contractor Summary'!$C$39,\"\",\"\")))","v":"No"},{"$f":"IF(OR(P62=\"Yes\",P62=\"No\")*AND(G62<'A - Contractor Summary'!$C$39),\"\",IF(AND(G62>'A - Contractor Summary'!$C$39,G62<'A - Contractor Summary'!$C$42),\"Yes\",IF(G62>'A - Contractor Summary'!$C$42,\"No\",\"Needs Review\")))","v":""},null,"No",0,0]
[null,50,null,null,null,null,null,null,null,null,null,null,{"$error":"#DIV/0!"},null,null,{"$f":"IF(AND(G63>='A - Contractor Summary'!$C$36,G63<='A - Contractor Summary'!$C$38),\"Yes\",IF(G63<'A - Contractor Summary'!$C$36,\"No\",IF(G63>'A - Contractor Summary'!$C$39,\"\",\"\")))","v":"No"},{"$f":"IF(OR(P63=\"Yes\",P63=\"No\")*AND(G63<'A - Contractor Summary'!$C$39),\"\",IF(AND(G63>'A - Contractor Summary'!$C$39,G63<'A - Contractor Summary'!$C$42),\"Yes\",IF(G63>'A - Contractor Summary'!$C$42,\"No\",\"Needs Review\")))","v":""},null,"No",0,0]
[null,51,null,null,null,null,null,null,null,null,null,null,{"$error":"#DIV/0!"},null,null,{"$f":"IF(AND(G64>='A - Contractor Summary'!$C$36,G64<='A - Contractor Summary'!$C$38),\"Yes\",IF(G64<'A - Contractor Summary'!$C$36,\"No\",IF(G64>'A - Contractor Summary'!$C$39,\"\",\"\")))","v":"No"},{"$f":"IF(OR(P64=\"Yes\",P64=\"No\")*AND(G64<'A - Contractor Summary'!$C$39),\"\",IF(AND(G64>'A - Contractor Summary'!$C$39,G64<'A - Contractor Summary'!$C$42),\"Yes\",IF(G64>'A - Contractor Summary'!$C$42,\"No\",\"Needs Review\")))","v":""},null,"No",0,0]
[null,52,null,null,null,null,null,null,null,null,null,null,{"$error":"#DIV/0!"},null,null,{"$f":"IF(AND(G65>='A - Contractor Summary'!$C$36,G65<='A - Contractor Summary'!$C$38),\"Yes\",IF(G65<'A - Contractor Summary'!$C$36,\"No\",IF(G65>'A - Contractor Summary'!$C$39,\"\",\"\")))","v":"No"},{"$f":"IF(OR(P65=\"Yes\",P65=\"No\")*AND(G65<'A - Contractor Summary'!$C$39),\"\",IF(AND(G65>'A - Contractor Summary'!$C$39,G65<'A - Contractor Summary'!$C$42),\"Yes\",IF(G65>'A - Contractor Summary'!$C$42,\"No\",\"Needs Review\")))","v":""},null,"No",0,0]
[null,53,null,null,null,null,null,null,null,null,null,null,{"$error":"#DIV/0!"},null,null,{"$f":"IF(AND(G66>='A - Contractor Summary'!$C$36,G66<='A - Contractor Summary'!$C$38),\"Yes\",IF(G66<'A - Contractor Summary'!$C$36,\"No\",IF(G66>'A - Contractor Summary'!$C$39,\"\",\"\")))","v":"No"},{"$f":"IF(OR(P66=\"Yes\",P66=\"No\")*AND(G66<'A - Contractor Summary'!$C$39),\"\",IF(AND(G66>'A - Contractor Summary'!$C$39,G66<'A - Contractor Summary'!$C$42),\"Yes\",IF(G66>'A - Contractor Summary'!$C$42,\"No\",\"Needs Review\")))","v":""},null,"No",0,0]
[null,54,null,null,null,null,null,null,null,null,null,null,{"$error":"#DIV/0!"},null,null,{"$f":"IF(AND(G67>='A - Contractor Summary'!$C$36,G67<='A - Contractor Summary'!$C$38),\"Yes\",IF(G67<'A - Contractor Summary'!$C$36,\"No\",IF(G67>'A - Contractor Summary'!$C$39,\"\",\"\")))","v":"No"},{"$f":"IF(OR(P67=\"Yes\",P67=\"No\")*AND(G67<'A - Contractor Summary'!$C$39),\"\",IF(AND(G67>'A - Contractor Summary'!$C$39,G67<'A - Contractor Summary'!$C$42),\"Yes\",IF(G67>'A - Contractor Summary'!$C$42,\"No\",\"Needs Review\")))","v":""},null,"No",0,0]
[null,55,null,null,null,null,null,null,null,null,null,null,{"$error":"#DIV/0!"},null,null,{"$f":"IF(AND(G68>='A - Contractor Summary'!$C$36,G68<='A - Contractor Summary'!$C$38),\"Yes\",IF(G68<'A - Contractor Summary'!$C$36,\"No\",IF(G68>'A - Contractor Summary'!$C$39,\"\",\"\")))","v":"No"},{"$f":"IF(OR(P68=\"Yes\",P68=\"No\")*AND(G68<'A - Contractor Summary'!$C$39),\"\",IF(AND(G68>'A - Contractor Summary'!$C$39,G68<'A - Contractor Summary'!$C$42),\"Yes\",IF(G68>'A - Contractor Summary'!$C$42,\"No\",\"Needs Review\")))","v":""},null,"No",0,0]
[null,56,null,null,null,null,null,null,null,null,null,null,{"$error":"#DIV/0!"},null,null,{"$f":"IF(AND(G69>='A - Contractor Summary'!$C$36,G69<='A - Contractor Summary'!$C$38),\"Yes\",IF(G69<'A - Contractor Summary'!$C$36,\"No\",IF(G69>'A - Contractor Summary'!$C$39,\"\",\"\")))","v":"No"},{"$f":"IF(OR(P69=\"Yes\",P69=\"No\")*AND(G69<'A - Contractor Summary'!$C$39),\"\",IF(AND(G69>'A - Contractor Summary'!$C$39,G69<'A - Contractor Summary'!$C$42),\"Yes\",IF(G69>'A - Contractor Summary'!$C$42,\"No\",\"Needs Review\")))","v":""},null,"No",0,0]
[null,57,null,null,null,null,null,null,null,null,null,null,{"$error":"#DIV/0!"},null,null,{"$f":"IF(AND(G70>='A - Contractor Summary'!$C$36,G70<='A - Contractor Summary'!$C$38),\"Yes\",IF(G70<'A - Contractor Summary'!$C$36,\"No\",IF(G70>'A - Contractor Summary'!$C$39,\"\",\"\")))","v":"No"},{"$f":"IF(OR(P70=\"Yes\",P70=\"No\")*AND(G70<'A - Contractor Summary'!$C$39),\"\",IF(AND(G70>'A - Contractor Summary'!$C$39,G70<'A - Contractor Summary'!$C$42),\"Yes\",IF(G70>'A - Contractor Summary'!$C$42,\"No\",\"Needs Review\")))","v":""},null,"No",0,0]
[null,58,null,null,null,null,null,null,null,null,null,null,{"$error":"#DIV/0!"},null,null,{"$f":"IF(AND(G71>='A - Contractor Summary'!$C$36,G71<='A - Contractor Summary'!$C$38),\"Yes\",IF(G71<'A - Contractor Summary'!$C$36,\"No\",IF(G71>'A - Contractor Summary'!$C$39,\"\",\"\")))","v":"No"},{"$f":"IF(OR(P71=\"Yes\",P71=\"No\")*AND(G71<'A - Contractor Summary'!$C$39),\"\",IF(AND(G71>'A - Contractor Summary'!$C$39,G71<'A - Contractor Summary'!$C$42),\"Yes\",IF(G71>'A - Contractor Summary'!$C$42,\"No\",\"Needs Review\")))","v":""},null,"No",0,0]
[null,59,null,null,null,null,null,null,null,null,null,null,{"$error":"#DIV/0!"},null,null,{"$f":"IF(AND(G72>='A - Contractor Summary'!$C$36,G72<='A - Contractor Summary'!$C$38),\"Yes\",IF(G72<'A - Contractor Summary'!$C$36,\"No\",IF(G72>'A - Contractor Summary'!$C$39,\"\",\"\")))","v":"No"},{"$f":"IF(OR(P72=\"Yes\",P72=\"No\")*AND(G72<'A - Contractor Summary'!$C$39),\"\",IF(AND(G72>'A - Contractor Summary'!$C$39,G72<'A - Contractor Summary'!$C$42),\"Yes\",IF(G72>'A - Contractor Summary'!$C$42,\"No\",\"Needs Review\")))","v":""},null,"No",0,0]
[null,60,null,null,null,null,null,null,null,null,null,null,{"$error":"#DIV/0!"},null,null,{"$f":"IF(AND(G73>='A - Contractor Summary'!$C$36,G73<='A - Contractor Summary'!$C$38),\"Yes\",IF(G73<'A - Contractor Summary'!$C$36,\"No\",IF(G73>'A - Contractor Summary'!$C$39,\"\",\"\")))","v":"No"},{"$f":"IF(OR(P73=\"Yes\",P73=\"No\")*AND(G73<'A - Contractor Summary'!$C$39),\"\",IF(AND(G73>'A - Contractor Summary'!$C$39,G73<'A - Contractor Summary'!$C$42),\"Yes\",IF(G73>'A - Contractor Summary'!$C$42,\"No\",\"Needs Review\")))","v":""},null,"No",0,0]
[null,61,null,null,null,null,null,null,null,null,null,null,{"$error":"#DIV/0!"},null,null,{"$f":"IF(AND(G74>='A - Contractor Summary'!$C$36,G74<='A - Contractor Summary'!$C$38),\"Yes\",IF(G74<'A - Contractor Summary'!$C$36,\"No\",IF(G74>'A - Contractor Summary'!$C$39,\"\",\"\")))","v":"No"},{"$f":"IF(OR(P74=\"Yes\",P74=\"No\")*AND(G74<'A - Contractor Summary'!$C$39),\"\",IF(AND(G74>'A - Contractor Summary'!$C$39,G74<'A - Contractor Summary'!$C$42),\"Yes\",IF(G74>'A - Contractor Summary'!$C$42,\"No\",\"Needs Review\")))","v":""},null,"No",0,0]
[null,62,null,null,null,null,null,null,null,null,null,null,{"$error":"#DIV/0!"},null,null,{"$f":"IF(AND(G75>='A - Contractor Summary'!$C$36,G75<='A - Contractor Summary'!$C$38),\"Yes\",IF(G75<'A - Contractor Summary'!$C$36,\"No\",IF(G75>'A - Contractor Summary'!$C$39,\"\",\"\")))","v":"No"},{"$f":"IF(OR(P75=\"Yes\",P75=\"No\")*AND(G75<'A - Contractor Summary'!$C$39),\"\",IF(AND(G75>'A - Contractor Summary'!$C$39,G75<'A - Contractor Summary'!$C$42),\"Yes\",IF(G75>'A - Contractor Summary'!$C$42,\"No\",\"Needs Review\")))","v":""},null,"No",0,0]
[null,63,null,null,null,null,null,null,null,null,null,null,{"$error":"#DIV/0!"},null,null,{"$f":"IF(AND(G76>='A - Contractor Summary'!$C$36,G76<='A - Contractor Summary'!$C$38),\"Yes\",IF(G76<'A - Contractor Summary'!$C$36,\"No\",IF(G76>'A - Contractor Summary'!$C$39,\"\",\"\")))","v":"No"},{"$f":"IF(OR(P76=\"Yes\",P76=\"No\")*AND(G76<'A - Contractor Summary'!$C$39),\"\",IF(AND(G76>'A - Contractor Summary'!$C$39,G76<'A - Contractor Summary'!$C$42),\"Yes\",IF(G76>'A - Contractor Summary'!$C$42,\"No\",\"Needs Review\")))","v":""},null,"No",0,0,null,null,3]
[null,64,null,null,null,null,null,null,null,null,null,null,{"$error":"#DIV/0!"},null,null,{"$f":"IF(AND(G77>='A - Contractor Summary'!$C$36,G77<='A - Contractor Summary'!$C$38),\"Yes\",IF(G77<'A - Contractor Summary'!$C$36,\"No\",IF(G77>'A - Contractor Summary'!$C$39,\"\",\"\")))","v":"No"},{"$f":"IF(OR(P77=\"Yes\",P77=\"No\")*AND(G77<'A - Contractor Summary'!$C$39),\"\",IF(AND(G77>'A - Contractor Summary'!$C$39,G77<'A - Contractor Summary'!$C$42),\"Yes\",IF(G77>'A - Contractor Summary'!$C$42,\"No\",\"Needs Review\")))","v":""},null,"No",0,0,null,null,3]
[null,65,null,null,null,null,null,null,null,null,null,null,{"$f":"L78/K78","v":{"$error":"#DIV/0!"}},null,null,{"$f":"IF(AND(G78>='A - Contractor Summary'!$C$36,G78<='A - Contractor Summary'!$C$38),\"Yes\",IF(G78<'A - Contractor Summary'!$C$36,\"No\",IF(G78>'A - Contractor Summary'!$C$39,\"\",\"\")))","v":"No"},{"$f":"IF(OR(P78=\"Yes\",P78=\"No\")*AND(G78<'A - Contractor Summary'!$C$39),\"\",IF(AND(G78>'A - Contractor Summary'!$C$39,G78<'A - Contractor Summary'!$C$42),\"Yes\",IF(G78>'A - Contractor Summary'!$C$42,\"No\",\"Needs Review\")))","v":""},null,{"$f":"IF(AND(R78=\"YES\",O78=\"Yes\",N78=\"Yes\")*OR(P78=\"Yes\",Q78=\"Yes\"),\"Yes\",IF(OR(N78=\"No\",O78=\"No\",P78=\"No\",Q78=\"No\",R78=\"No\"),\"No\",\"Needs Review\"))","v":"No"},{"$f":"IF(S78=\"Yes\",L78,0)","v":0},{"$f":"IF(S78=\"Needs Review\",L78,0)","v":0}]
[null,66,null,null,null,null,null,null,null,null,null,null,{"$error":"#DIV/0!"},null,null,{"$f":"IF(AND(G79>='A - Contractor Summary'!$C$36,G79<='A - Contractor Summary'!$C$38),\"Yes\",IF(G79<'A - Contractor Summary'!$C$36,\"No\",IF(G79>'A - Contractor Summary'!$C$39,\"\",\"\")))","v":"No"},{"$f":"IF(OR(P79=\"Yes\",P79=\"No\")*AND(G79<'A - Contractor Summary'!$C$39),\"\",IF(AND(G79>'A - Contractor Summary'!$C$39,G79<'A - Contractor Summary'!$C$42),\"Yes\",IF(G79>'A - Contractor Summary'!$C$42,\"No\",\"Needs Review\")))","v":""},null,"No",0,0]
[null,67,null,null,null,null,null,null,null,null,null,null,{"$error":"#DIV/0!"},null,null,{"$f":"IF(AND(G80>='A - Contractor Summary'!$C$36,G80<='A - Contractor Summary'!$C$38),\"Yes\",IF(G80<'A - Contractor Summary'!$C$36,\"No\",IF(G80>'A - Contractor Summary'!$C$39,\"\",\"\")))","v":"No"},{"$f":"IF(OR(P80=\"Yes\",P80=\"No\")*AND(G80<'A - Contractor Summary'!$C$39),\"\",IF(AND(G80>'A - Contractor Summary'!$C$39,G80<'A - Contractor Summary'!$C$42),\"Yes\",IF(G80>'A - Contractor Summary'!$C$42,\"No\",\"Needs Review\")))","v":""},null,"No",0,0]
[null,68,null,null,null,null,null,null,null,null,null,null,{"$error":"#DIV/0!"},null,null,{"$f":"IF(AND(G81>='A - Contractor Summary'!$C$36,G81<='A - Contractor Summary'!$C$38),\"Yes\",IF(G81<'A - Contractor Summary'!$C$36,\"No\",IF(G81>'A - Contractor Summary'!$C$39,\"\",\"\")))","v":"No"},{"$f":"IF(OR(P81=\"Yes\",P81=\"No\")*AND(G81<'A - Contractor Summary'!$C$39),\"\",IF(AND(G81>'A - Contractor Summary'!$C$39,G81<'A - Contractor Summary'!$C$42),\"Yes\",IF(G81>'A - Contractor Summary'!$C$42,\"No\",\"Needs Review\")))","v":""},null,"No",0,0,null,null,3]
[null,69,null,null,null,null,null,null,null,null,null,null,{"$error":"#DIV/0!"},null,null,{"$f":"IF(AND(G82>='A - Contractor Summary'!$C$36,G82<='A - Contractor Summary'!$C$38),\"Yes\",IF(G82<'A - Contractor Summary'!$C$36,\"No\",IF(G82>'A - Contractor Summary'!$C$39,\"\",\"\")))","v":"No"},{"$f":"IF(OR(P82=\"Yes\",P82=\"No\")*AND(G82<'A - Contractor Summary'!$C$39),\"\",IF(AND(G82>'A - Contractor Summary'!$C$39,G82<'A - Contractor Summary'!$C$42),\"Yes\",IF(G82>'A - Contractor Summary'!$C$42,\"No\",\"Needs Review\")))","v":""},null,"No",0,0,null,null,3]
[null,70,null,null,null,null,null,null,null,null,null,null,{"$error":"#DIV/0!"},null,null,{"$f":"IF(AND(G83>='A - Contractor Summary'!$C$36,G83<='A - Contractor Summary'!$C$38),\"Yes\",IF(G83<'A - Contractor Summary'!$C$36,\"No\",IF(G83>'A - Contractor Summary'!$C$39,\"\",\"\")))","v":"No"},{"$f":"IF(OR(P83=\"Yes\",P83=\"No\")*AND(G83<'A - Contractor Summary'!$C$39),\"\",IF(AND(G83>'A - Contractor Summary'!$C$39,G83<'A - Contractor Summary'!$C$42),\"Yes\",IF(G83>'A - Contractor Summary'!$C$42,\"No\",\"Needs Review\")))","v":""},null,"No",0,0]
[null,71,null,null,null,null,null,null,null,null,null,null,{"$error":"#DIV/0!"},null,null,{"$f":"IF(AND(G84>='A - Contractor Summary'!$C$36,G84<='A - Contractor Summary'!$C$38),\"Yes\",IF(G84<'A - Contractor Summary'!$C$36,\"No\",IF(G84>'A - Contractor Summary'!$C$39,\"\",\"\")))","v":"No"},{"$f":"IF(OR(P84=\"Yes\",P84=\"No\")*AND(G84<'A - Contractor Summary'!$C$39),\"\",IF(AND(G84>'A - Contractor Summary'!$C$39,G84<'A - Contractor Summary'!$C$42),\"Yes\",IF(G84>'A - Contractor Summary'!$C$42,\"No\",\"Needs Review\")))","v":""},null,"No",0,0]
[null,72,null,null,null,null,null,null,null,null,null,null,{"$error":"#DIV/0!"},null,null,{"$f":"IF(AND(G85>='A - Contractor Summary'!$C$36,G85<='A - Contractor Summary'!$C$38),\"Yes\",IF(G85<'A - Contractor Summary'!$C$36,\"No\",IF(G85>'A - Contractor Summary'!$C$39,\"\",\"\")))","v":"No"},{"$f":"IF(OR(P85=\"Yes\",P85=\"No\")*AND(G85<'A - Contractor Summary'!$C$39),\"\",IF(AND(G85>'A - Contractor Summary'!$C$39,G85<'A - Contractor Summary'!$C$42),\"Yes\",IF(G85>'A - Contractor Summary'!$C$42,\"No\",\"Needs Review\")))","v":""},null,"No",0,0]
[null,73,null,null,null,null,null,null,null,null,null,null,{"$error":"#DIV/0!"},null,null,{"$f":"IF(AND(G86>='A - Contractor Summary'!$C$36,G86<='A - Contractor Summary'!$C$38),\"Yes\",IF(G86<'A - Contractor Summary'!$C$36,\"No\",IF(G86>'A - Contractor Summary'!$C$39,\"\",\"\")))","v":"No"},{"$f":"IF(OR(P86=\"Yes\",P86=\"No\")*AND(G86<'A - Contractor Summary'!$C$39),\"\",IF(AND(G86>'A - Contractor Summary'!$C$39,G86<'A - Contractor Summary'!$C$42),\"Yes\",IF(G86>'A - Contractor Summary'!$C$42,\"No\",\"Needs Review\")))","v":""},null,"No",0,0]
[null,74,null,null,null,null,null,null,null,null,null,null,{"$error":"#DIV/0!"},null,null,{"$f":"IF(AND(G87>='A - Contractor Summary'!$C$36,G87<='A - Contractor Summary'!$C$38),\"Yes\",IF(G87<'A - Contractor Summary'!$C$36,\"No\",IF(G87>'A - Contractor Summary'!$C$39,\"\",\"\")))","v":"No"},{"$f":"IF(OR(P87=\"Yes\",P87=\"No\")*AND(G87<'A - Contractor Summary'!$C$39),\"\",IF(AND(G87>'A - Contractor Summary'!$C$39,G87<'A - Contractor Summary'!$C$42),\"Yes\",IF(G87>'A - Contractor Summary'!$C$42,\"No\",\"Needs Review\")))","v":""},null,"No",0,0]
[null,75,null,null,null,null,null,null,null,null,null,null,{"$error":"#DIV/0!"},null,null,{"$f":"IF(AND(G88>='A - Contractor Summary'!$C$36,G88<='A - Contractor Summary'!$C$38),\"Yes\",IF(G88<'A - Contractor Summary'!$C$36,\"No\",IF(G88>'A - Contractor Summary'!$C$39,\"\",\"\")))","v":"No"},{"$f":"IF(OR(P88=\"Yes\",P88=\"No\")*AND(G88<'A - Contractor Summary'!$C$39),\"\",IF(AND(G88>'A - Contractor Summary'!$C$39,G88<'A - Contractor Summary'!$C$42),\"Yes\",IF(G88>'A - Contractor Summary'!$C$42,\"No\",\"Needs Review\")))","v":""},null,"No",0,71.680000000000007,{"$f":"+M88","v":{"$error":"#DIV/0!"}},null,4]
[null,76,null,null,null,null,null,null,null,null,null,null,{"$error":"#DIV/0!"},null,null,{"$f":"IF(AND(G89>='A - Contractor Summary'!$C$36,G89<='A - Contractor Summary'!$C$38),\"Yes\",IF(G89<'A - Contractor Summary'!$C$36,\"No\",IF(G89>'A - Contractor Summary'!$C$39,\"\",\"\")))","v":"No"},{"$f":"IF(OR(P89=\"Yes\",P89=\"No\")*AND(G89<'A - Contractor Summary'!$C$39),\"\",IF(AND(G89>'A - Contractor Summary'!$C$39,G89<'A - Contractor Summary'!$C$42),\"Yes\",IF(G89>'A - Contractor Summary'!$C$42,\"No\",\"Needs Review\")))","v":""},null,"No",0,71.680000000000007,{"$f":"+M89","v":{"$error":"#DIV/0!"}},null,4]
[null,77,null,null,null,null,null,null,null,null,null,null,{"$error":"#DIV/0!"},null,null,{"$f":"IF(AND(G90>='A - Contractor Summary'!$C$36,G90<='A - Contractor Summary'!$C$38),\"Yes\",IF(G90<'A - Contractor Summary'!$C$36,\"No\",IF(G90>'A - Contractor Summary'!$C$39,\"\",\"\")))","v":"No"},{"$f":"IF(OR(P90=\"Yes\",P90=\"No\")*AND(G90<'A - Contractor Summary'!$C$39),\"\",IF(AND(G90>'A - Contractor Summary'!$C$39,G90<'A - Contractor Summary'!$C$42),\"Yes\",IF(G90>'A - Contractor Summary'!$C$42,\"No\",\"Needs Review\")))","v":""},null,"No",0,0,null,null,"2,3"]
[null,78,null,null,null,null,null,null,null,null,null,null,{"$error":"#DIV/0!"},null,null,{"$f":"IF(AND(G91>='A - Contractor Summary'!$C$36,G91<='A - Contractor Summary'!$C$38),\"Yes\",IF(G91<'A - Contractor Summary'!$C$36,\"No\",IF(G91>'A - Contractor Summary'!$C$39,\"\",\"\")))","v":"No"},{"$f":"IF(OR(P91=\"Yes\",P91=\"No\")*AND(G91<'A - Contractor Summary'!$C$39),\"\",IF(AND(G91>'A - Contractor Summary'!$C$39,G91<'A - Contractor Summary'!$C$42),\"Yes\",IF(G91>'A - Contractor Summary'!$C$42,\"No\",\"Needs Review\")))","v":""},null,"No",0,0,null,null,1]
[null,79,null,null,null,null,null,null,null,null,null,null,{"$error":"#DIV/0!"},null,null,{"$f":"IF(AND(G92>='A - Contractor Summary'!$C$36,G92<='A - Contractor Summary'!$C$38),\"Yes\",IF(G92<'A - Contractor Summary'!$C$36,\"No\",IF(G92>'A - Contractor Summary'!$C$39,\"\",\"\")))","v":"No"},{"$f":"IF(OR(P92=\"Yes\",P92=\"No\")*AND(G92<'A - Contractor Summary'!$C$39),\"\",IF(AND(G92>'A - Contractor Summary'!$C$39,G92<'A - Contractor Summary'!$C$42),\"Yes\",IF(G92>'A - Contractor Summary'!$C$42,\"No\",\"Needs Review\")))","v":""},null,"No",0,0,null,null,1]
[null,null,null,null,null,null,null,null,null,null,null,{"$f":"SUM(L14:L92)","v":0},null,null,null,null,null,null,null,{"$f":"IFERROR(SUM(T14:T92),0)","v":0},{"$f":"IFERROR(SUM(U14:U92),0)","v":143.36000000000001},0,{"$f":"IFERROR(SUM(W14:W92),0)","v":0},{"$f":"U93-V93-W93","v":143.36000000000001},"check (a)"]
[]
[]
[null,"Tickmark Explanation:"]
[null,1]
[null,2]
[null,3]
[null,4]

{"sheet":"E - Fuel","index":9,"n_rows":40,"n_cols":22,"rows_kept":40,"cut":false,"hidden":false,"merged":[[1,1,1,20],[3,1,6,11],[11,12,11,20],[11,1,11,11],[4,15,6,20]]}
[]
[null,"Fuel Charges"]
[]
[null,"Test Plan: (A) Obtain support of individual charges. (B) Enter Yes/No if receipt is itemized (C) Enter Yes/No if proof of payment has been provided. (D) Ensure charges fall between the dates the vendor was mobilized and the date they arrived.  (E) Ensure charges are prior to the date the vendor arrived home or was released to another utility.  (F) Ensure the location of charge was reasonable (G) Determine the amount(s) to be reviewed, allowed  and/or disallowed.  (H)  For charges which required further review, document review (include why it was determined to be allowed/disallowed via a tickmark)."]
[null,null,null,null,null,null,null,null,null,null,null,null,null,null,null,"No Fuel Charges"]
[]
[]
[]
[null,"a","Check figure should equal $0.  Cell will appear yellow if discrepancies are noted."]
[]
[null,null,"A",null,null,null,null,null,null,null,"B","C","D","E","F","G",null,null,"H"]
[null,"Support Reviewed",null,null,null,null,null,null,null,null,null,null,"Conclusions"]
[null,"#","Type of Support","Support Identifier","Company","Date","Person","Name","Location","Total Charge","Itemized Receipt","Proof of Payment","Reasonable based on Mobilization date(s)","Reasonable based on Demobilization date(s)","Locations Reasonable","Conclusion","$ Allowable Charge","$ To Be Reviewed","Reviewed - Allowable Charge","Reviewed - Unallowable Charge","Tickmarks"]
[null,1,null,null,null,null,null,null,null,null,null,null,{"$f":"IF(AND(F14>='A - Contractor Summary'!$C$36,F14<='A - Contractor Summary'!$C$38),\"Yes\",IF(F14<'A - Contractor Summary'!$C$36,\"No\",IF(F14>'A - Contractor Summary'!$C$39,\"\",\"\")))","v":"No"},{"$f":"IF(OR(M14=\"Yes\",M14=\"No\")*AND(F14<'A - Contractor Summary'!$C$39),\"\",IF(AND(F14>'A - Contractor Summary'!$C$39,F14<'A - Contractor Summary'!$C$42),\"Yes\",IF(F14>'A - Contractor Summary'!$C$42,\"No\",\"Needs Review\")))","v":""},null,{"$f":"IF(AND(O14=\"Yes\",K14=\"Yes\",L14=\"Yes\")*OR(N14=\"Yes\",M14=\"Yes\"),\"Yes\",IF(OR(K14=\"No\",M14=\"No\",N14=\"No\",O14=\"No\",L14=\"No\"),\"No\",\"Needs Review\"))","v":"No"},{"$f":"IF(P14=\"Yes\",J14,0)","v":0},{"$f":"IF(P14=\"Needs Review\",J14,0)","v":0}]
[null,2,null,null,null,null,null,null,null,null,null,null,{"$f":"IF(AND(F15>='A - Contractor Summary'!$C$36,F15<='A - Contractor Summary'!$C$38),\"Yes\",IF(F15<'A - Contractor Summary'!$C$36,\"No\",IF(F15>'A - Contractor Summary'!$C$39,\"\",\"\")))","v":"No"},{"$f":"IF(OR(M15=\"Yes\",M15=\"No\")*AND(F15<'A - Contractor Summary'!$C$39),\"\",IF(AND(F15>'A - Contractor Summary'!$C$39,F15<'A - Contractor Summary'!$C$42),\"Yes\",IF(F15>'A - Contractor Summary'!$C$42,\"No\",\"Needs Review\")))","v":""},null,{"$f":"IF(AND(O15=\"Yes\",K15=\"Yes\",L15=\"Yes\")*OR(N15=\"Yes\",M15=\"Yes\"),\"Yes\",IF(OR(K15=\"No\",M15=\"No\",N15=\"No\",O15=\"No\",L15=\"No\"),\"No\",\"Needs Review\"))","v":"No"},0,0]
[null,3,null,null,null,null,null,null,null,null,null,null,{"$f":"IF(AND(F16>='A - Contractor Summary'!$C$36,F16<='A - Contractor Summary'!$C$38),\"Yes\",IF(F16<'A - Contractor Summary'!$C$36,\"No\",IF(F16>'A - Contractor Summary'!$C$39,\"\",\"\")))","v":"No"},{"$f":"IF(OR(M16=\"Yes\",M16=\"No\")*AND(F16<'A - Contractor Summary'!$C$39),\"\",IF(AND(F16>'A - Contractor Summary'!$C$39,F16<'A - Contractor Summary'!$C$42),\"Yes\",IF(F16>'A - Contractor Summary'!$C$42,\"No\",\"Needs Review\")))","v":""},null,"No",0,0]
[null,4,null,null,null,null,null,null,null,null,null,null,{"$f":"IF(AND(F17>='A - Contractor Summary'!$C$36,F17<='A - Contractor Summary'!$C$38),\"Yes\",IF(F17<'A - Contractor Summary'!$C$36,\"No\",IF(F17>'A - Contractor Summary'!$C$39,\"\",\"\")))","v":"No"},{"$f":"IF(OR(M17=\"Yes\",M17=\"No\")*AND(F17<'A - Contractor Summary'!$C$39),\"\",IF(AND(F17>'A - Contractor Summary'!$C$39,F17<'A - Contractor Summary'!$C$42),\"Yes\",IF(F17>'A - Contractor Summary'!$C$42,\"No\",\"Needs Review\")))","v":""},null,"No",0,0]
[null,5,null,null,null,null,null,null,null,null,null,null,{"$f":"IF(AND(F18>='A - Contractor Summary'!$C$36,F18<='A - Contractor Summary'!$C$38),\"Yes\",IF(F18<'A - Contractor Summary'!$C$36,\"No\",IF(F18>'A - Contractor Summary'!$C$39,\"\",\"\")))","v":"No"},{"$f":"IF(OR(M18=\"Yes\",M18=\"No\")*AND(F18<'A - Contractor Summary'!$C$39),\"\",IF(AND(F18>'A - Contractor Summary'!$C$39,F18<'A - Contractor Summary'!$C$42),\"Yes\",IF(F18>'A - Contractor Summary'!$C$42,\"No\",\"Needs Review\")))","v":""},null,"No",0,0]
[null,6,null,null,null,null,null,null,null,null,null,null,{"$f":"IF(AND(F19>='A - Contractor Summary'!$C$36,F19<='A - Contractor Summary'!$C$38),\"Yes\",IF(F19<'A - Contractor Summary'!$C$36,\"No\",IF(F19>'A - Contractor Summary'!$C$39,\"\",\"\")))","v":"No"},{"$f":"IF(OR(M19=\"Yes\",M19=\"No\")*AND(F19<'A - Contractor Summary'!$C$39),\"\",IF(AND(F19>'A - Contractor Summary'!$C$39,F19<'A - Contractor Summary'!$C$42),\"Yes\",IF(F19>'A - Contractor Summary'!$C$42,\"No\",\"Needs Review\")))","v":""},null,"No",0,0]
[null,7,null,null,null,null,null,null,null,null,null,null,{"$f":"IF(AND(F20>='A - Contractor Summary'!$C$36,F20<='A - Contractor Summary'!$C$38),\"Yes\",IF(F20<'A - Contractor Summary'!$C$36,\"No\",IF(F20>'A - Contractor Summary'!$C$39,\"\",\"\")))","v":"No"},{"$f":"IF(OR(M20=\"Yes\",M20=\"No\")*AND(F20<'A - Contractor Summary'!$C$39),\"\",IF(AND(F20>'A - Contractor Summary'!$C$39,F20<'A - Contractor Summary'!$C$42),\"Yes\",IF(F20>'A - Contractor Summary'!$C$42,\"No\",\"Needs Review\")))","v":""},null,"No",0,0]
[null,8,null,null,null,null,null,null,null,null,null,null,{"$f":"IF(AND(F21>='A - Contractor Summary'!$C$36,F21<='A - Contractor Summary'!$C$38),\"Yes\",IF(F21<'A - Contractor Summary'!$C$36,\"No\",IF(F21>'A - Contractor Summary'!$C$39,\"\",\"\")))","v":"No"},{"$f":"IF(OR(M21=\"Yes\",M21=\"No\")*AND(F21<'A - Contractor Summary'!$C$39),\"\",IF(AND(F21>'A - Contractor Summary'!$C$39,F21<'A - Contractor Summary'!$C$42),\"Yes\",IF(F21>'A - Contractor Summary'!$C$42,\"No\",\"Needs Review\")))","v":""},null,"No",0,0]
[null,9,null,null,null,null,null,null,null,null,null,null,{"$f":"IF(AND(F22>='A - Contractor Summary'!$C$36,F22<='A - Contractor Summary'!$C$38),\"Yes\",IF(F22<'A - Contractor Summary'!$C$36,\"No\",IF(F22>'A - Contractor Summary'!$C$39,\"\",\"\")))","v":"No"},{"$f":"IF(OR(M22=\"Yes\",M22=\"No\")*AND(F22<'A - Contractor Summary'!$C$39),\"\",IF(AND(F22>'A - Contractor Summary'!$C$39,F22<'A - Contractor Summary'!$C$42),\"Yes\",IF(F22>'A - Contractor Summary'!$C$42,\"No\",\"Needs Review\")))","v":""},null,"No",0,0]
[null,10,null,null,null,null,null,null,null,null,null,null,{"$f":"IF(AND(F23>='A - Contractor Summary'!$C$36,F23<='A - Contractor Summary'!$C$38),\"Yes\",IF(F23<'A - Contractor Summary'!$C$36,\"No\",IF(F23>'A - Contractor Summary'!$C$39,\"\",\"\")))","v":"No"},{"$f":"IF(OR(M23=\"Yes\",M23=\"No\")*AND(F23<'A - Contractor Summary'!$C$39),\"\",IF(AND(F23>'A - Contractor Summary'!$C$39,F23<'A - Contractor Summary'!$C$42),\"Yes\",IF(F23>'A - Contractor Summary'!$C$42,\"No\",\"Needs Review\")))","v":""},null,"No",0,0]
[null,11,null,null,null,null,null,null,null,null,null,null,{"$f":"IF(AND(F24>='A - Contractor Summary'!$C$36,F24<='A - Contractor Summary'!$C$38),\"Yes\",IF(F24<'A - Contractor Summary'!$C$36,\"No\",IF(F24>'A - Contractor Summary'!$C$39,\"\",\"\")))","v":"No"},{"$f":"IF(OR(M24=\"Yes\",M24=\"No\")*AND(F24<'A - Contractor Summary'!$C$39),\"\",IF(AND(F24>'A - Contractor Summary'!$C$39,F24<'A - Contractor Summary'!$C$42),\"Yes\",IF(F24>'A - Contractor Summary'!$C$42,\"No\",\"Needs Review\")))","v":""},null,"No",0,0]
[null,12,null,null,null,null,null,null,null,null,null,null,{"$f":"IF(AND(F25>='A - Contractor Summary'!$C$36,F25<='A - Contractor Summary'!$C$38),\"Yes\",IF(F25<'A - Contractor Summary'!$C$36,\"No\",IF(F25>'A - Contractor Summary'!$C$39,\"\",\"\")))","v":"No"},{"$f":"IF(OR(M25=\"Yes\",M25=\"No\")*AND(F25<'A - Contractor Summary'!$C$39),\"\",IF(AND(F25>'A - Contractor Summary'!$C$39,F25<'A - Contractor Summary'!$C$42),\"Yes\",IF(F25>'A - Contractor Summary'!$C$42,\"No\",\"Needs Review\")))","v":""},null,"No",0,0]
[null,13,null,null,null,null,null,null,null,null,null,null,{"$f":"IF(AND(F26>='A - Contractor Summary'!$C$36,F26<='A - Contractor Summary'!$C$38),\"Yes\",IF(F26<'A - Contractor Summary'!$C$36,\"No\",IF(F26>'A - Contractor Summary'!$C$39,\"\",\"\")))","v":"No"},{"$f":"IF(OR(M26=\"Yes\",M26=\"No\")*AND(F26<'A - Contractor Summary'!$C$39),\"\",IF(AND(F26>'A - Contractor Summary'!$C$39,F26<'A - Contractor Summary'!$C$42),\"Yes\",IF(F26>'A - Contractor Summary'!$C$42,\"No\",\"Needs Review\")))","v":""},null,"No",0,0]
[null,14,null,null,null,null,null,null,null,null,null,null,{"$f":"IF(AND(F27>='A - Contractor Summary'!$C$36,F27<='A - Contractor Summary'!$C$38),\"Yes\",IF(F27<'A - Contractor Summary'!$C$36,\"No\",IF(F27>'A - Contractor Summary'!$C$39,\"\",\"\")))","v":"No"},{"$f":"IF(OR(M27=\"Yes\",M27=\"No\")*AND(F27<'A - Contractor Summary'!$C$39),\"\",IF(AND(F27>'A - Contractor Summary'!$C$39,F27<'A - Contractor Summary'!$C$42),\"Yes\",IF(F27>'A - Contractor Summary'!$C$42,\"No\",\"Needs Review\")))","v":""},null,"No",0,0]
[null,15,null,null,null,null,null,null,null,null,null,null,{"$f":"IF(AND(F28>='A - Contractor Summary'!$C$36,F28<='A - Contractor Summary'!$C$38),\"Yes\",IF(F28<'A - Contractor Summary'!$C$36,\"No\",IF(F28>'A - Contractor Summary'!$C$39,\"\",\"\")))","v":"No"},{"$f":"IF(OR(M28=\"Yes\",M28=\"No\")*AND(F28<'A - Contractor Summary'!$C$39),\"\",IF(AND(F28>'A - Contractor Summary'!$C$39,F28<'A - Contractor Summary'!$C$42),\"Yes\",IF(F28>'A - Contractor Summary'!$C$42,\"No\",\"Needs Review\")))","v":""},null,"No",0,0]
[null,16,null,null,null,null,null,null,null,null,null,null,{"$f":"IF(AND(F29>='A - Contractor Summary'!$C$36,F29<='A - Contractor Summary'!$C$38),\"Yes\",IF(F29<'A - Contractor Summary'!$C$36,\"No\",IF(F29>'A - Contractor Summary'!$C$39,\"\",\"\")))","v":"No"},{"$f":"IF(OR(M29=\"Yes\",M29=\"No\")*AND(F29<'A - Contractor Summary'!$C$39),\"\",IF(AND(F29>'A - Contractor Summary'!$C$39,F29<'A - Contractor Summary'!$C$42),\"Yes\",IF(F29>'A - Contractor Summary'!$C$42,\"No\",\"Needs Review\")))","v":""},null,"No",0,0]
[null,17,null,null,null,null,null,null,null,null,null,null,{"$f":"IF(AND(F30>='A - Contractor Summary'!$C$36,F30<='A - Contractor Summary'!$C$38),\"Yes\",IF(F30<'A - Contractor Summary'!$C$36,\"No\",IF(F30>'A - Contractor Summary'!$C$39,\"\",\"\")))","v":"No"},{"$f":"IF(OR(M30=\"Yes\",M30=\"No\")*AND(F30<'A - Contractor Summary'!$C$39),\"\",IF(AND(F30>'A - Contractor Summary'!$C$39,F30<'A - Contractor Summary'!$C$42),\"Yes\",IF(F30>'A - Contractor Summary'!$C$42,\"No\",\"Needs Review\")))","v":""},null,"No",0,0]
[null,18,null,null,null,null,null,null,null,null,null,null,{"$f":"IF(AND(F31>='A - Contractor Summary'!$C$36,F31<='A - Contractor Summary'!$C$38),\"Yes\",IF(F31<'A - Contractor Summary'!$C$36,\"No\",IF(F31>'A - Contractor Summary'!$C$39,\"\",\"\")))","v":"No"},{"$f":"IF(OR(M31=\"Yes\",M31=\"No\")*AND(F31<'A - Contractor Summary'!$C$39),\"\",IF(AND(F31>'A - Contractor Summary'!$C$39,F31<'A - Contractor Summary'!$C$42),\"Yes\",IF(F31>'A - Contractor Summary'!$C$42,\"No\",\"Needs Review\")))","v":""},null,"No",{"$f":"IF(P31=\"Yes\",#REF!,0)","v":0},{"$f":"IF(P31=\"ED Review\",#REF!,0)","v":0}]
[null,19,null,null,null,null,null,null,null,null,null,null,{"$f":"IF(AND(F32>='A - Contractor Summary'!$C$36,F32<='A - Contractor Summary'!$C$38),\"Yes\",IF(F32<'A - Contractor Summary'!$C$36,\"No\",IF(F32>'A - Contractor Summary'!$C$39,\"\",\"\")))","v":"No"},{"$f":"IF(OR(M32=\"Yes\",M32=\"No\")*AND(F32<'A - Contractor Summary'!$C$39),\"\",IF(AND(F32>'A - Contractor Summary'!$C$39,F32<'A - Contractor Summary'!$C$42),\"Yes\",IF(F32>'A - Contractor Summary'!$C$42,\"No\",\"Needs Review\")))","v":""},null,"No",{"$f":"IF(P32=\"Yes\",#REF!,0)","v":0},{"$f":"IF(P32=\"ED Review\",#REF!,0)","v":0}]
[null,20,null,null,null,null,null,null,null,null,null,null,{"$f":"IF(AND(F33>='A - Contractor Summary'!$C$36,F33<='A - Contractor Summary'!$C$38),\"Yes\",IF(F33<'A - Contractor Summary'!$C$36,\"No\",IF(F33>'A - Contractor Summary'!$C$39,\"\",\"\")))","v":"No"},{"$f":"IF(OR(M33=\"Yes\",M33=\"No\")*AND(F33<'A - Contractor Summary'!$C$39),\"\",IF(AND(F33>'A - Contractor Summary'!$C$39,F33<'A - Contractor Summary'!$C$42),\"Yes\",IF(F33>'A - Contractor Summary'!$C$42,\"No\",\"Needs Review\")))","v":""},null,"No",{"$f":"IF(P33=\"Yes\",#REF!,0)","v":0},{"$f":"IF(P33=\"ED Review\",#REF!,0)","v":0}]
[null,null,null,null,null,null,null,null,null,{"$f":"SUM(J14:J33)","v":0},null,null,null,null,null,null,{"$f":"IFERROR(SUM(Q14:Q33),0)","v":0},{"$f":"IFERROR(SUM(R14:R33),0)","v":0},{"$f":"SUM(S14:S33)","v":0},{"$f":"SUM(T14:T33)","v":0},{"$f":"R34-S34-T34","v":0},"check (a)"]
[]
[]
[]
[]
[]
[null,"Tickmark Explanation:"]

{"sheet":"F - Meals","index":10,"n_rows":152,"n_cols":23,"rows_kept":152,"cut":false,"hidden":false,"merged":[[11,13,11,21],[3,1,6,12],[1,1,1,21],[11,1,11,12]]}
[]
[null,"Meal Charges"]
[]
[null,"Test Plan: (A) Obtain support of individual charges.  (B) Enter Yes/No if receipt is itemized.  (C) Enter Yes/No if proof of payment has been provided.  (D) Ensure charges fall between the dates the vendor was mobilized and the date they arrived.  (E) Ensure charges are prior to the date the vendor arrived home or was released to another utility.  (F) Ensure the location of charge was reasonable (G) Determine the amount(s) to be reviewed, allowed and/or disallowed.  (H) For charges which required further review, document review and include why it was determined to be allowed/disallowed via a tickmark. "]
[]
[]
[]
[]
[null,"a","Check figure should equal $0.  Cell will appear yellow if discrepancies are noted."]
[]
[null,null,"A",null,null,null,null,null,null,null,null,"B","C","D","E","F","G",null,null,"H"]
[null,"Support Reviewed",null,null,null,null,null,null,null,null,null,null,null,"Conclusions"]
[null,"#","Type of Support","Support Identifier","Company","Crew","Date","Person"," Restaurant Name","Location","$ Total","Itemized Receipt","Proof of Payment","Reasonable based on Mobilization date(s)","Reasonable based on Demobilization date(s)","Locations Reasonable","Conclusion","$ Allowable Charge","$ To Be Reviewed","Reviewed - Allowable Charge","Reviewed - Unallowable Charge","Tickmarks"]
[null,1,null,null,null,null,null,null,null,null,null,null,null,{"$f":"IF(AND(G14>='A - Contractor Summary'!$C$36,G14<='A - Contractor Summary'!$C$38),\"Yes\",IF(G14<'A - Contractor Summary'!$C$36,\"No\",IF(G14>'A - Contractor Summary'!$C$39,\"\",\"\")))","v":"No"},{"$f":"IF(OR(N14=\"Yes\",N14=\"No\")*AND(G14<'A - Contractor Summary'!$C$39),\"\",IF(AND(G14>'A - Contractor Summary'!$C$39,G14<'A - Contractor Summary'!$C$42),\"Yes\",IF(G14>'A - Contractor Summary'!$C$42,\"No\",\"Needs Review\")))","v":""},"Yes",{"$f":"IF(AND(P14=\"Yes\",L14=\"Yes\",M14=\"Yes\")*OR(O14=\"Yes\",N14=\"Yes\"),\"Yes\",IF(OR(L14=\"No\",N14=\"No\",O14=\"No\",P14=\"No\",M14=\"No\"),\"No\",\"Needs Review\"))","v":"No"},{"$f":"IF(Q14=\"Yes\",K14,0)","v":0},{"$f":"IF(Q14=\"Needs Review\",K14,0)","v":0},0,0]
[null,2,null,null,null,null,null,null,null,null,null,null,null,{"$f":"IF(AND(G15>='A - Contractor Summary'!$C$36,G15<='A - Contractor Summary'!$C$38),\"Yes\",IF(G15<'A - Contractor Summary'!$C$36,\"No\",IF(G15>'A - Contractor Summary'!$C$39,\"\",\"\")))","v":"No"},{"$f":"IF(OR(N15=\"Yes\",N15=\"No\")*AND(G15<'A - Contractor Summary'!$C$39),\"\",IF(AND(G15>'A - Contractor Summary'!$C$39,G15<'A - Contractor Summary'!$C$42),\"Yes\",IF(G15>'A - Contractor Summary'!$C$42,\"No\",\"Needs Review\")))","v":""},"Yes","No",0,0,0,0]
[null,3,null,null,null,null,null,null,null,null,null,null,null,{"$f":"IF(AND(G16>='A - Contractor Summary'!$C$36,G16<='A - Contractor Summary'!$C$38),\"Yes\",IF(G16<'A - Contractor Summary'!$C$36,\"No\",IF(G16>'A - Contractor Summary'!$C$39,\"\",\"\")))","v":"No"},{"$f":"IF(OR(N16=\"Yes\",N16=\"No\")*AND(G16<'A - Contractor Summary'!$C$39),\"\",IF(AND(G16>'A - Contractor Summary'!$C$39,G16<'A - Contractor Summary'!$C$42),\"Yes\",IF(G16>'A - Contractor Summary'!$C$42,\"No\",\"Needs Review\")))","v":""},"Yes","No",0,0,0,0]
[null,4,null,null,null,null,null,null,null,null,null,null,null,{"$f":"IF(AND(G17>='A - Contractor Summary'!$C$36,G17<='A - Contractor Summary'!$C$38),\"Yes\",IF(G17<'A - Contractor Summary'!$C$36,\"No\",IF(G17>'A - Contractor Summary'!$C$39,\"\",\"\")))","v":"No"},{"$f":"IF(OR(N17=\"Yes\",N17=\"No\")*AND(G17<'A - Contractor Summary'!$C$39),\"\",IF(AND(G17>'A - Contractor Summary'!$C$39,G17<'A - Contractor Summary'!$C$42),\"Yes\",IF(G17>'A - Contractor Summary'!$C$42,\"No\",\"Needs Review\")))","v":""},"Yes","No",0,0,0,0]
[null,5,null,null,null,null,null,null,null,null,null,null,null,{"$f":"IF(AND(G18>='A - Contractor Summary'!$C$36,G18<='A - Contractor Summary'!$C$38),\"Yes\",IF(G18<'A - Contractor Summary'!$C$36,\"No\",IF(G18>'A - Contractor Summary'!$C$39,\"\",\"\")))","v":"No"},{"$f":"IF(OR(N18=\"Yes\",N18=\"No\")*AND(G18<'A - Contractor Summary'!$C$39),\"\",IF(AND(G18>'A - Contractor Summary'!$C$39,G18<'A - Contractor Summary'!$C$42),\"Yes\",IF(G18>'A - Contractor Summary'!$C$42,\"No\",\"Needs Review\")))","v":""},"No","No",0,0,0,0]
[null,6,null,null,null,null,null,null,null,null,null,null,null,{"$f":"IF(AND(G19>='A - Contractor Summary'!$C$36,G19<='A - Contractor Summary'!$C$38),\"Yes\",IF(G19<'A - Contractor Summary'!$C$36,\"No\",IF(G19>'A - Contractor Summary'!$C$39,\"\",\"\")))","v":"No"},{"$f":"IF(OR(N19=\"Yes\",N19=\"No\")*AND(G19<'A - Contractor Summary'!$C$39),\"\",IF(AND(G19>'A - Contractor Summary'!$C$39,G19<'A - Contractor Summary'!$C$42),\"Yes\",IF(G19>'A - Contractor Summary'!$C$42,\"No\",\"Needs Review\")))","v":""},"Yes","No",0,0]
[null,7,null,null,null,null,null,null,null,null,null,null,null,{"$f":"IF(AND(G20>='A - Contractor Summary'!$C$36,G20<='A - Contractor Summary'!$C$38),\"Yes\",IF(G20<'A - Contractor Summary'!$C$36,\"No\",IF(G20>'A - Contractor Summary'!$C$39,\"\",\"\")))","v":"No"},{"$f":"IF(OR(N20=\"Yes\",N20=\"No\")*AND(G20<'A - Contractor Summary'!$C$39),\"\",IF(AND(G20>'A - Contractor Summary'!$C$39,G20<'A - Contractor Summary'!$C$42),\"Yes\",IF(G20>'A - Contractor Summary'!$C$42,\"No\",\"Needs Review\")))","v":""},"Yes","No",0,0]
[null,8,null,null,null,null,null,null,null,null,null,null,null,{"$f":"IF(AND(G21>='A - Contractor Summary'!$C$36,G21<='A - Contractor Summary'!$C$38),\"Yes\",IF(G21<'A - Contractor Summary'!$C$36,\"No\",IF(G21>'A - Contractor Summary'!$C$39,\"\",\"\")))","v":"No"},{"$f":"IF(OR(N21=\"Yes\",N21=\"No\")*AND(G21<'A - Contractor Summary'!$C$39),\"\",IF(AND(G21>'A - Contractor Summary'!$C$39,G21<'A - Contractor Summary'!$C$42),\"Yes\",IF(G21>'A - Contractor Summary'!$C$42,\"No\",\"Needs Review\")))","v":""},"Yes","No",0,0]
[null,9,null,null,null,null,null,null,null,null,null,null,null,{"$f":"IF(AND(G22>='A - Contractor Summary'!$C$36,G22<='A - Contractor Summary'!$C$38),\"Yes\",IF(G22<'A - Contractor Summary'!$C$36,\"No\",IF(G22>'A - Contractor Summary'!$C$39,\"\",\"\")))","v":"No"},{"$f":"IF(OR(N22=\"Yes\",N22=\"No\")*AND(G22<'A - Contractor Summary'!$C$39),\"\",IF(AND(G22>'A - Contractor Summary'!$C$39,G22<'A - Contractor Summary'!$C$42),\"Yes\",IF(G22>'A - Contractor Summary'!$C$42,\"No\",\"Needs Review\")))","v":""},"Yes","No",0,0]
[null,10,null,null,null,null,null,null,null,null,null,null,null,{"$f":"IF(AND(G23>='A - Contractor Summary'!$C$36,G23<='A - Contractor Summary'!$C$38),\"Yes\",IF(G23<'A - Contractor Summary'!$C$36,\"No\",IF(G23>'A - Contractor Summary'!$C$39,\"\",\"\")))","v":"No"},{"$f":"IF(OR(N23=\"Yes\",N23=\"No\")*AND(G23<'A - Contractor Summary'!$C$39),\"\",IF(AND(G23>'A - Contractor Summary'!$C$39,G23<'A - Contractor Summary'!$C$42),\"Yes\",IF(G23>'A - Contractor Summary'!$C$42,\"No\",\"Needs Review\")))","v":""},"Yes","No",0,0,0,0]
[null,11,null,null,null,null,null,null,null,null,null,null,null,{"$f":"IF(AND(G24>='A - Contractor Summary'!$C$36,G24<='A - Contractor Summary'!$C$38),\"Yes\",IF(G24<'A - Contractor Summary'!$C$36,\"No\",IF(G24>'A - Contractor Summary'!$C$39,\"\",\"\")))","v":"No"},{"$f":"IF(OR(N24=\"Yes\",N24=\"No\")*AND(G24<'A - Contractor Summary'!$C$39),\"\",IF(AND(G24>'A - Contractor Summary'!$C$39,G24<'A - Contractor Summary'!$C$42),\"Yes\",IF(G24>'A - Contractor Summary'!$C$42,\"No\",\"Needs Review\")))","v":""},"Yes","No",0,0,0,0]
[null,12,null,null,null,null,null,null,null,null,null,null,null,{"$f":"IF(AND(G25>='A - Contractor Summary'!$C$36,G25<='A - Contractor Summary'!$C$38),\"Yes\",IF(G25<'A - Contractor Summary'!$C$36,\"No\",IF(G25>'A - Contractor Summary'!$C$39,\"\",\"\")))","v":"No"},{"$f":"IF(OR(N25=\"Yes\",N25=\"No\")*AND(G25<'A - Contractor Summary'!$C$39),\"\",IF(AND(G25>'A - Contractor Summary'!$C$39,G25<'A - Contractor Summary'!$C$42),\"Yes\",IF(G25>'A - Contractor Summary'!$C$42,\"No\",\"Needs Review\")))","v":""},"Yes","No",0,0,0,0]
[null,13,null,null,null,null,null,null,null,null,null,null,null,{"$f":"IF(AND(G26>='A - Contractor Summary'!$C$36,G26<='A - Contractor Summary'!$C$38),\"Yes\",IF(G26<'A - Contractor Summary'!$C$36,\"No\",IF(G26>'A - Contractor Summary'!$C$39,\"\",\"\")))","v":"No"},{"$f":"IF(OR(N26=\"Yes\",N26=\"No\")*AND(G26<'A - Contractor Summary'!$C$39),\"\",IF(AND(G26>'A - Contractor Summary'!$C$39,G26<'A - Contractor Summary'!$C$42),\"Yes\",IF(G26>'A - Contractor Summary'!$C$42,\"No\",\"Needs Review\")))","v":""},"Yes","No",0,0,0,0]
[null,14,null,null,null,null,null,null,null,null,null,null,null,{"$f":"IF(AND(G27>='A - Contractor Summary'!$C$36,G27<='A - Contractor Summary'!$C$38),\"Yes\",IF(G27<'A - Contractor Summary'!$C$36,\"No\",IF(G27>'A - Contractor Summary'!$C$39,\"\",\"\")))","v":"No"},{"$f":"IF(OR(N27=\"Yes\",N27=\"No\")*AND(G27<'A - Contractor Summary'!$C$39),\"\",IF(AND(G27>'A - Contractor Summary'!$C$39,G27<'A - Contractor Summary'!$C$42),\"Yes\",IF(G27>'A - Contractor Summary'!$C$42,\"No\",\"Needs Review\")))","v":""},"Yes","No",0,0,0,0]
[null,15,null,null,null,null,null,null,null,null,null,null,null,{"$f":"IF(AND(G28>='A - Contractor Summary'!$C$36,G28<='A - Contractor Summary'!$C$38),\"Yes\",IF(G28<'A - Contractor Summary'!$C$36,\"No\",IF(G28>'A - Contractor Summary'!$C$39,\"\",\"\")))","v":"No"},{"$f":"IF(OR(N28=\"Yes\",N28=\"No\")*AND(G28<'A - Contractor Summary'!$C$39),\"\",IF(AND(G28>'A - Contractor Summary'!$C$39,G28<'A - Contractor Summary'!$C$42),\"Yes\",IF(G28>'A - Contractor Summary'!$C$42,\"No\",\"Needs Review\")))","v":""},"Yes","No",0,0,0,0]
[null,16,null,null,null,null,null,null,null,null,null,null,null,{"$f":"IF(AND(G29>='A - Contractor Summary'!$C$36,G29<='A - Contractor Summary'!$C$38),\"Yes\",IF(G29<'A - Contractor Summary'!$C$36,\"No\",IF(G29>'A - Contractor Summary'!$C$39,\"\",\"\")))","v":"No"},{"$f":"IF(OR(N29=\"Yes\",N29=\"No\")*AND(G29<'A - Contractor Summary'!$C$39),\"\",IF(AND(G29>'A - Contractor Summary'!$C$39,G29<'A - Contractor Summary'!$C$42),\"Yes\",IF(G29>'A - Contractor Summary'!$C$42,\"No\",\"Needs Review\")))","v":""},"No","No",0,0,0,0]
[null,17,null,null,null,null,null,null,null,null,null,null,null,{"$f":"IF(AND(G30>='A - Contractor Summary'!$C$36,G30<='A - Contractor Summary'!$C$38),\"Yes\",IF(G30<'A - Contractor Summary'!$C$36,\"No\",IF(G30>'A - Contractor Summary'!$C$39,\"\",\"\")))","v":"No"},{"$f":"IF(OR(N30=\"Yes\",N30=\"No\")*AND(G30<'A - Contractor Summary'!$C$39),\"\",IF(AND(G30>'A - Contractor Summary'!$C$39,G30<'A - Contractor Summary'!$C$42),\"Yes\",IF(G30>'A - Contractor Summary'!$C$42,\"No\",\"Needs Review\")))","v":""},"Yes","No",0,0]
[null,18,null,null,null,null,null,null,null,null,null,null,null,{"$f":"IF(AND(G31>='A - Contractor Summary'!$C$36,G31<='A - Contractor Summary'!$C$38),\"Yes\",IF(G31<'A - Contractor Summary'!$C$36,\"No\",IF(G31>'A - Contractor Summary'!$C$39,\"\",\"\")))","v":"No"},{"$f":"IF(OR(N31=\"Yes\",N31=\"No\")*AND(G31<'A - Contractor Summary'!$C$39),\"\",IF(AND(G31>'A - Contractor Summary'!$C$39,G31<'A - Contractor Summary'!$C$42),\"Yes\",IF(G31>'A - Contractor Summary'!$C$42,\"No\",\"Needs Review\")))","v":""},"Yes","No",0,0]
[null,19,null,null,null,null,null,null,null,null,null,null,null,{"$f":"IF(AND(G32>='A - Contractor Summary'!$C$36,G32<='A - Contractor Summary'!$C$38),\"Yes\",IF(G32<'A - Contractor Summary'!$C$36,\"No\",IF(G32>'A - Contractor Summary'!$C$39,\"\",\"\")))","v":"No"},{"$f":"IF(OR(N32=\"Yes\",N32=\"No\")*AND(G32<'A - Contractor Summary'!$C$39),\"\",IF(AND(G32>'A - Contractor Summary'!$C$39,G32<'A - Contractor Summary'!$C$42),\"Yes\",IF(G32>'A - Contractor Summary'!$C$42,\"No\",\"Needs Review\")))","v":""},"Yes","No",0,0,0,0]
[null,20,null,null,null,null,null,null,null,null,null,null,null,{"$f":"IF(AND(G33>='A - Contractor Summary'!$C$36,G33<='A - Contractor Summary'!$C$38),\"Yes\",IF(G33<'A - Contractor Summary'!$C$36,\"No\",IF(G33>'A - Contractor Summary'!$C$39,\"\",\"\")))","v":"No"},{"$f":"IF(OR(N33=\"Yes\",N33=\"No\")*AND(G33<'A - Contractor Summary'!$C$39),\"\",IF(AND(G33>'A - Contractor Summary'!$C$39,G33<'A - Contractor Summary'!$C$42),\"Yes\",IF(G33>'A - Contractor Summary'!$C$42,\"No\",\"Needs Review\")))","v":""},"Yes","No",0,0]
[null,21,null,null,null,null,null,null,null,null,null,null,null,{"$f":"IF(AND(G34>='A - Contractor Summary'!$C$36,G34<='A - Contractor Summary'!$C$38),\"Yes\",IF(G34<'A - Contractor Summary'!$C$36,\"No\",IF(G34>'A - Contractor Summary'!$C$39,\"\",\"\")))","v":"No"},{"$f":"IF(OR(N34=\"Yes\",N34=\"No\")*AND(G34<'A - Contractor Summary'!$C$39),\"\",IF(AND(G34>'A - Contractor Summary'!$C$39,G34<'A - Contractor Summary'!$C$42),\"Yes\",IF(G34>'A - Contractor Summary'!$C$42,\"No\",\"Needs Review\")))","v":""},"Yes","No",0,0]
[null,22,null,null,null,null,null,null,null,null,null,null,null,{"$f":"IF(AND(G35>='A - Contractor Summary'!$C$36,G35<='A - Contractor Summary'!$C$38),\"Yes\",IF(G35<'A - Contractor Summary'!$C$36,\"No\",IF(G35>'A - Contractor Summary'!$C$39,\"\",\"\")))","v":"No"},{"$f":"IF(OR(N35=\"Yes\",N35=\"No\")*AND(G35<'A - Contractor Summary'!$C$39),\"\",IF(AND(G35>'A - Contractor Summary'!$C$39,G35<'A - Contractor Summary'!$C$42),\"Yes\",IF(G35>'A - Contractor Summary'!$C$42,\"No\",\"Needs Review\")))","v":""},"Yes","No",0,0,0,0]
[null,23,null,null,null,null,null,null,null,null,null,null,null,{"$f":"IF(AND(G36>='A - Contractor Summary'!$C$36,G36<='A - Contractor Summary'!$C$38),\"Yes\",IF(G36<'A - Contractor Summary'!$C$36,\"No\",IF(G36>'A - Contractor Summary'!$C$39,\"\",\"\")))","v":"No"},{"$f":"IF(OR(N36=\"Yes\",N36=\"No\")*AND(G36<'A - Contractor Summary'!$C$39),\"\",IF(AND(G36>'A - Contractor Summary'!$C$39,G36<'A - Contractor Summary'!$C$42),\"Yes\",IF(G36>'A - Contractor Summary'!$C$42,\"No\",\"Needs Review\")))","v":""},"Yes","No",0,0,0,0]
[null,24,null,null,null,null,null,null,null,null,null,null,null,{"$f":"IF(AND(G37>='A - Contractor Summary'!$C$36,G37<='A - Contractor Summary'!$C$38),\"Yes\",IF(G37<'A - Contractor Summary'!$C$36,\"No\",IF(G37>'A - Contractor Summary'!$C$39,\"\",\"\")))","v":"No"},{"$f":"IF(OR(N37=\"Yes\",N37=\"No\")*AND(G37<'A - Contractor Summary'!$C$39),\"\",IF(AND(G37>'A - Contractor Summary'!$C$39,G37<'A - Contractor Summary'!$C$42),\"Yes\",IF(G37>'A - Contractor Summary'!$C$42,\"No\",\"Needs Review\")))","v":""},"Yes","No",0,0]
[null,25,null,null,null,null,null,null,null,null,null,null,null,{"$f":"IF(AND(G38>='A - Contractor Summary'!$C$36,G38<='A - Contractor Summary'!$C$38),\"Yes\",IF(G38<'A - Contractor Summary'!$C$36,\"No\",IF(G38>'A - Contractor Summary'!$C$39,\"\",\"\")))","v":"No"},{"$f":"IF(OR(N38=\"Yes\",N38=\"No\")*AND(G38<'A - Contractor Summary'!$C$39),\"\",IF(AND(G38>'A - Contractor Summary'!$C$39,G38<'A - Contractor Summary'!$C$42),\"Yes\",IF(G38>'A - Contractor Summary'!$C$42,\"No\",\"Needs Review\")))","v":""},"Yes","No",0,0]
[null,26,null,null,null,null,null,null,null,null,null,null,null,{"$f":"IF(AND(G39>='A - Contractor Summary'!$C$36,G39<='A - Contractor Summary'!$C$38),\"Yes\",IF(G39<'A - Contractor Summary'!$C$36,\"No\",IF(G39>'A - Contractor Summary'!$C$39,\"\",\"\")))","v":"No"},{"$f":"IF(OR(N39=\"Yes\",N39=\"No\")*AND(G39<'A - Contractor Summary'!$C$39),\"\",IF(AND(G39>'A - Contractor Summary'!$C$39,G39<'A - Contractor Summary'!$C$42),\"Yes\",IF(G39>'A - Contractor Summary'!$C$42,\"No\",\"Needs Review\")))","v":""},"Yes","No",0,0]
[null,27,null,null,null,null,null,null,null,null,null,null,null,{"$f":"IF(AND(G40>='A - Contractor Summary'!$C$36,G40<='A - Contractor Summary'!$C$38),\"Yes\",IF(G40<'A - Contractor Summary'!$C$36,\"No\",IF(G40>'A - Contractor Summary'!$C$39,\"\",\"\")))","v":"No"},{"$f":"IF(OR(N40=\"Yes\",N40=\"No\")*AND(G40<'A - Contractor Summary'!$C$39),\"\",IF(AND(G40>'A - Contractor Summary'!$C$39,G40<'A - Contractor Summary'!$C$42),\"Yes\",IF(G40>'A - Contractor Summary'!$C$42,\"No\",\"Needs Review\")))","v":""},"Yes","No",0,0]
[null,28,null,null,null,null,null,null,null,null,null,null,null,{"$f":"IF(AND(G41>='A - Contractor Summary'!$C$36,G41<='A - Contractor Summary'!$C$38),\"Yes\",IF(G41<'A - Contractor Summary'!$C$36,\"No\",IF(G41>'A - Contractor Summary'!$C$39,\"\",\"\")))","v":"No"},{"$f":"IF(OR(N41=\"Yes\",N41=\"No\")*AND(G41<'A - Contractor Summary'!$C$39),\"\",IF(AND(G41>'A - Contractor Summary'!$C$39,G41<'A - Contractor Summary'!$C$42),\"Yes\",IF(G41>'A - Contractor Summary'!$C$42,\"No\",\"Needs Review\")))","v":""},"Yes","No",0,0,0,0]
[null,29,null,null,null,null,null,null,null,null,null,null,null,{"$f":"IF(AND(G42>='A - Contractor Summary'!$C$36,G42<='A - Contractor Summary'!$C$38),\"Yes\",IF(G42<'A - Contractor Summary'!$C$36,\"No\",IF(G42>'A - Contractor Summary'!$C$39,\"\",\"\")))","v":"No"},{"$f":"IF(OR(N42=\"Yes\",N42=\"No\")*AND(G42<'A - Contractor Summary'!$C$39),\"\",IF(AND(G42>'A - Contractor Summary'!$C$39,G42<'A - Contractor Summary'!$C$42),\"Yes\",IF(G42>'A - Contractor Summary'!$C$42,\"No\",\"Needs Review\")))","v":""},"Yes","No",0,0]
[null,30,null,null,null,null,null,null,null,null,null,null,null,{"$f":"IF(AND(G43>='A - Contractor Summary'!$C$36,G43<='A - Contractor Summary'!$C$38),\"Yes\",IF(G43<'A - Contractor Summary'!$C$36,\"No\",IF(G43>'A - Contractor Summary'!$C$39,\"\",\"\")))","v":"No"},{"$f":"IF(OR(N43=\"Yes\",N43=\"No\")*AND(G43<'A - Contractor Summary'!$C$39),\"\",IF(AND(G43>'A - Contractor Summary'!$C$39,G43<'A - Contractor Summary'!$C$42),\"Yes\",IF(G43>'A - Contractor Summary'!$C$42,\"No\",\"Needs Review\")))","v":""},"Yes","No",0,0]
[null,31,null,null,null,null,null,null,null,null,null,null,null,{"$f":"IF(AND(G44>='A - Contractor Summary'!$C$36,G44<='A - Contractor Summary'!$C$38),\"Yes\",IF(G44<'A - Contractor Summary'!$C$36,\"No\",IF(G44>'A - Contractor Summary'!$C$39,\"\",\"\")))","v":"No"},{"$f":"IF(OR(N44=\"Yes\",N44=\"No\")*AND(G44<'A - Contractor Summary'!$C$39),\"\",IF(AND(G44>'A - Contractor Summary'!$C$39,G44<'A - Contractor Summary'!$C$42),\"Yes\",IF(G44>'A - Contractor Summary'!$C$42,\"No\",\"Needs Review\")))","v":""},"Yes","No",0,0]
[null,32,null,null,null,null,null,null,null,null,null,null,null,{"$f":"IF(AND(G45>='A - Contractor Summary'!$C$36,G45<='A - Contractor Summary'!$C$38),\"Yes\",IF(G45<'A - Contractor Summary'!$C$36,\"No\",IF(G45>'A - Contractor Summary'!$C$39,\"\",\"\")))","v":"No"},{"$f":"IF(OR(N45=\"Yes\",N45=\"No\")*AND(G45<'A - Contractor Summary'!$C$39),\"\",IF(AND(G45>'A - Contractor Summary'!$C$39,G45<'A - Contractor Summary'!$C$42),\"Yes\",IF(G45>'A - Contractor Summary'!$C$42,\"No\",\"Needs Review\")))","v":""},"Yes","No",0,0]
[null,33,null,null,null,null,null,null,null,null,null,null,null,{"$f":"IF(AND(G46>='A - Contractor Summary'!$C$36,G46<='A - Contractor Summary'!$C$38),\"Yes\",IF(G46<'A - Contractor Summary'!$C$36,\"No\",IF(G46>'A - Contractor Summary'!$C$39,\"\",\"\")))","v":"No"},{"$f":"IF(OR(N46=\"Yes\",N46=\"No\")*AND(G46<'A - Contractor Summary'!$C$39),\"\",IF(AND(G46>'A - Contractor Summary'!$C$39,G46<'A - Contractor Summary'!$C$42),\"Yes\",IF(G46>'A - Contractor Summary'!$C$42,\"No\",\"Needs Review\")))","v":""},"Yes",{"$f":"IF(AND(P46=\"Yes\",L46=\"Yes\",M46=\"Yes\")*OR(O46=\"Yes\",N46=\"Yes\"),\"Yes\",IF(OR(L46=\"No\",N46=\"No\",O46=\"No\",P46=\"No\",M46=\"No\"),\"No\",\"Needs Review\"))","v":"No"},{"$f":"IF(Q46=\"Yes\",K46,0)","v":0},{"$f":"IF(Q46=\"Needs Review\",K46,0)","v":0}]
[null,34,null,null,null,null,null,null,null,null,null,null,null,{"$f":"IF(AND(G47>='A - Contractor Summary'!$C$36,G47<='A - Contractor Summary'!$C$38),\"Yes\",IF(G47<'A - Contractor Summary'!$C$36,\"No\",IF(G47>'A - Contractor Summary'!$C$39,\"\",\"\")))","v":"No"},{"$f":"IF(OR(N47=\"Yes\",N47=\"No\")*AND(G47<'A - Contractor Summary'!$C$39),\"\",IF(AND(G47>'A - Contractor Summary'!$C$39,G47<'A - Contractor Summary'!$C$42),\"Yes\",IF(G47>'A - Contractor Summary'!$C$42,\"No\",\"Needs Review\")))","v":""},"Yes","No",0,0]
[null,35,null,null,null,null,null,null,null,null,null,null,null,{"$f":"IF(AND(G48>='A - Contractor Summary'!$C$36,G48<='A - Contractor Summary'!$C$38),\"Yes\",IF(G48<'A - Contractor Summary'!$C$36,\"No\",IF(G48>'A - Contractor Summary'!$C$39,\"\",\"\")))","v":"No"},{"$f":"IF(OR(N48=\"Yes\",N48=\"No\")*AND(G48<'A - Contractor Summary'!$C$39),\"\",IF(AND(G48>'A - Contractor Summary'!$C$39,G48<'A - Contractor Summary'!$C$42),\"Yes\",IF(G48>'A - Contractor Summary'!$C$42,\"No\",\"Needs Review\")))","v":""},"Yes","No",0,0,0,0]
[null,36,null,null,null,null,null,null,null,null,null,null,null,{"$f":"IF(AND(G49>='A - Contractor Summary'!$C$36,G49<='A - Contractor Summary'!$C$38),\"Yes\",IF(G49<'A - Contractor Summary'!$C$36,\"No\",IF(G49>'A - Contractor Summary'!$C$39,\"\",\"\")))","v":"No"},{"$f":"IF(OR(N49=\"Yes\",N49=\"No\")*AND(G49<'A - Contractor Summary'!$C$39),\"\",IF(AND(G49>'A - Contractor Summary'!$C$39,G49<'A - Contractor Summary'!$C$42),\"Yes\",IF(G49>'A - Contractor Summary'!$C$42,\"No\",\"Needs Review\")))","v":""},"Yes","No",0,0]
[null,37,null,null,null,null,null,null,null,null,null,null,null,{"$f":"IF(AND(G50>='A - Contractor Summary'!$C$36,G50<='A - Contractor Summary'!$C$38),\"Yes\",IF(G50<'A - Contractor Summary'!$C$36,\"No\",IF(G50>'A - Contractor Summary'!$C$39,\"\",\"\")))","v":"No"},{"$f":"IF(OR(N50=\"Yes\",N50=\"No\")*AND(G50<'A - Contractor Summary'!$C$39),\"\",IF(AND(G50>'A - Contractor Summary'!$C$39,G50<'A - Contractor Summary'!$C$42),\"Yes\",IF(G50>'A - Contractor Summary'!$C$42,\"No\",\"Needs Review\")))","v":""},"Yes","No",0,0]
[null,38,null,null,null,null,null,null,null,null,null,null,null,{"$f":"IF(AND(G51>='A - Contractor Summary'!$C$36,G51<='A - Contractor Summary'!$C$38),\"Yes\",IF(G51<'A - Contractor Summary'!$C$36,\"No\",IF(G51>'A - Contractor Summary'!$C$39,\"\",\"\")))","v":"No"},{"$f":"IF(OR(N51=\"Yes\",N51=\"No\")*AND(G51<'A - Contractor Summary'!$C$39),\"\",IF(AND(G51>'A - Contractor Summary'!$C$39,G51<'A - Contractor Summary'!$C$42),\"Yes\",IF(G51>'A - Contractor Summary'!$C$42,\"No\",\"Needs Review\")))","v":""},"Yes","No",0,0]
[null,39,null,null,null,null,null,null,null,null,null,null,null,{"$f":"IF(AND(G52>='A - Contractor Summary'!$C$36,G52<='A - Contractor Summary'!$C$38),\"Yes\",IF(G52<'A - Contractor Summary'!$C$36,\"No\",IF(G52>'A - Contractor Summary'!$C$39,\"\",\"\")))","v":"No"},{"$f":"IF(OR(N52=\"Yes\",N52=\"No\")*AND(G52<'A - Contractor Summary'!$C$39),\"\",IF(AND(G52>'A - Contractor Summary'!$C$39,G52<'A - Contractor Summary'!$C$42),\"Yes\",IF(G52>'A - Contractor Summary'!$C$42,\"No\",\"Needs Review\")))","v":""},"Yes","No",0,0,0,0]
[null,40,null,null,null,null,null,null,null,null,null,null,null,{"$f":"IF(AND(G53>='A - Contractor Summary'!$C$36,G53<='A - Contractor Summary'!$C$38),\"Yes\",IF(G53<'A - Contractor Summary'!$C$36,\"No\",IF(G53>'A - Contractor Summary'!$C$39,\"\",\"\")))","v":"No"},{"$f":"IF(OR(N53=\"Yes\",N53=\"No\")*AND(G53<'A - Contractor Summary'!$C$39),\"\",IF(AND(G53>'A - Contractor Summary'!$C$39,G53<'A - Contractor Summary'!$C$42),\"Yes\",IF(G53>'A - Contractor Summary'!$C$42,\"No\",\"Needs Review\")))","v":""},"Yes","No",0,0,0,0]
[null,41,null,null,null,null,null,null,null,null,null,null,null,{"$f":"IF(AND(G54>='A - Contractor Summary'!$C$36,G54<='A - Contractor Summary'!$C$38),\"Yes\",IF(G54<'A - Contractor Summary'!$C$36,\"No\",IF(G54>'A - Contractor Summary'!$C$39,\"\",\"\")))","v":"No"},{"$f":"IF(OR(N54=\"Yes\",N54=\"No\")*AND(G54<'A - Contractor Summary'!$C$39),\"\",IF(AND(G54>'A - Contractor Summary'!$C$39,G54<'A - Contractor Summary'!$C$42),\"Yes\",IF(G54>'A - Contractor Summary'!$C$42,\"No\",\"Needs Review\")))","v":""},"Yes","No",0,0]
[null,42,null,null,null,null,null,null,null,null,null,null,null,{"$f":"IF(AND(G55>='A - Contractor Summary'!$C$36,G55<='A - Contractor Summary'!$C$38),\"Yes\",IF(G55<'A - Contractor Summary'!$C$36,\"No\",IF(G55>'A - Contractor Summary'!$C$39,\"\",\"\")))","v":"No"},{"$f":"IF(OR(N55=\"Yes\",N55=\"No\")*AND(G55<'A - Contractor Summary'!$C$39),\"\",IF(AND(G55>'A - Contractor Summary'!$C$39,G55<'A - Contractor Summary'!$C$42),\"Yes\",IF(G55>'A - Contractor Summary'!$C$42,\"No\",\"Needs Review\")))","v":""},"No","No",0,0,0,0]
[null,43,null,null,null,null,null,null,null,null,null,null,null,{"$f":"IF(AND(G56>='A - Contractor Summary'!$C$36,G56<='A - Contractor Summary'!$C$38),\"Yes\",IF(G56<'A - Contractor Summary'!$C$36,\"No\",IF(G56>'A - Contractor Summary'!$C$39,\"\",\"\")))","v":"No"},{"$f":"IF(OR(N56=\"Yes\",N56=\"No\")*AND(G56<'A - Contractor Summary'!$C$39),\"\",IF(AND(G56>'A - Contractor Summary'!$C$39,G56<'A - Contractor Summary'!$C$42),\"Yes\",IF(G56>'A - Contractor Summary'!$C$42,\"No\",\"Needs Review\")))","v":""},"Yes","No",0,0,0,0]
[null,44,null,null,null,null,null,null,null,null,null,null,null,{"$f":"IF(AND(G57>='A - Contractor Summary'!$C$36,G57<='A - Contractor Summary'!$C$38),\"Yes\",IF(G57<'A - Contractor Summary'!$C$36,\"No\",IF(G57>'A - Contractor Summary'!$C$39,\"\",\"\")))","v":"No"},{"$f":"IF(OR(N57=\"Yes\",N57=\"No\")*AND(G57<'A - Contractor Summary'!$C$39),\"\",IF(AND(G57>'A - Contractor Summary'!$C$39,G57<'A - Contractor Summary'!$C$42),\"Yes\",IF(G57>'A - Contractor Summary'!$C$42,\"No\",\"Needs Review\")))","v":""},"Yes","No",0,0]
[null,46,null,null,null,null,null,null,null,null,null,null,null,{"$f":"IF(AND(G58>='A - Contractor Summary'!$C$36,G58<='A - Contractor Summary'!$C$38),\"Yes\",IF(G58<'A - Contractor Summary'!$C$36,\"No\",IF(G58>'A - Contractor Summary'!$C$39,\"\",\"\")))","v":"No"},{"$f":"IF(OR(N58=\"Yes\",N58=\"No\")*AND(G58<'A - Contractor Summary'!$C$39),\"\",IF(AND(G58>'A - Contractor Summary'!$C$39,G58<'A - Contractor Summary'!$C$42),\"Yes\",IF(G58>'A - Contractor Summary'!$C$42,\"No\",\"Needs Review\")))","v":""},"Yes","No",0,0]
[null,47,null,null,null,null,null,null,null,null,null,null,null,{"$f":"IF(AND(G59>='A - Contractor Summary'!$C$36,G59<='A - Contractor Summary'!$C$38),\"Yes\",IF(G59<'A - Contractor Summary'!$C$36,\"No\",IF(G59>'A - Contractor Summary'!$C$39,\"\",\"\")))","v":"No"},{"$f":"IF(OR(N59=\"Yes\",N59=\"No\")*AND(G59<'A - Contractor Summary'!$C$39),\"\",IF(AND(G59>'A - Contractor Summary'!$C$39,G59<'A - Contractor Summary'!$C$42),\"Yes\",IF(G59>'A - Contractor Summary'!$C$42,\"No\",\"Needs Review\")))","v":""},"Yes","No",0,0]
[null,48,null,null,null,null,null,null,null,null,null,null,null,{"$f":"IF(AND(G60>='A - Contractor Summary'!$C$36,G60<='A - Contractor Summary'!$C$38),\"Yes\",IF(G60<'A - Contractor Summary'!$C$36,\"No\",IF(G60>'A - Contractor Summary'!$C$39,\"\",\"\")))","v":"No"},{"$f":"IF(OR(N60=\"Yes\",N60=\"No\")*AND(G60<'A - Contractor Summary'!$C$39),\"\",IF(AND(G60>'A - Contractor Summary'!$C$39,G60<'A - Contractor Summary'!$C$42),\"Yes\",IF(G60>'A - Contractor Summary'!$C$42,\"No\",\"Needs Review\")))","v":""},"Yes","No",0,0]
[null,49,null,null,null,null,null,null,null,null,null,null,null,{"$f":"IF(AND(G61>='A - Contractor Summary'!$C$36,G61<='A - Contractor Summary'!$C$38),\"Yes\",IF(G61<'A - Contractor Summary'!$C$36,\"No\",IF(G61>'A - Contractor Summary'!$C$39,\"\",\"\")))","v":"No"},{"$f":"IF(OR(N61=\"Yes\",N61=\"No\")*AND(G61<'A - Contractor Summary'!$C$39),\"\",IF(AND(G61>'A - Contractor Summary'!$C$39,G61<'A - Contractor Summary'!$C$42),\"Yes\",IF(G61>'A - Contractor Summary'!$C$42,\"No\",\"Needs Review\")))","v":""},"Yes","No",0,0]
[null,50,null,null,null,null,null,null,null,null,null,null,null,{"$f":"IF(AND(G62>='A - Contractor Summary'!$C$36,G62<='A - Contractor Summary'!$C$38),\"Yes\",IF(G62<'A - Contractor Summary'!$C$36,\"No\",IF(G62>'A - Contractor Summary'!$C$39,\"\",\"\")))","v":"No"},{"$f":"IF(OR(N62=\"Yes\",N62=\"No\")*AND(G62<'A - Contractor Summary'!$C$39),\"\",IF(AND(G62>'A - Contractor Summary'!$C$39,G62<'A - Contractor Summary'!$C$42),\"Yes\",IF(G62>'A - Contractor Summary'!$C$42,\"No\",\"Needs Review\")))","v":""},"Yes","No",0,0]
[null,51,null,null,null,null,null,null,null,null,null,null,null,{"$f":"IF(AND(G63>='A - Contractor Summary'!$C$36,G63<='A - Contractor Summary'!$C$38),\"Yes\",IF(G63<'A - Contractor Summary'!$C$36,\"No\",IF(G63>'A - Contractor Summary'!$C$39,\"\",\"\")))","v":"No"},{"$f":"IF(OR(N63=\"Yes\",N63=\"No\")*AND(G63<'A - Contractor Summary'!$C$39),\"\",IF(AND(G63>'A - Contractor Summary'!$C$39,G63<'A - Contractor Summary'!$C$42),\"Yes\",IF(G63>'A - Contractor Summary'!$C$42,\"No\",\"Needs Review\")))","v":""},"Yes","No",0,0]
[null,52,null,null,null,null,null,null,null,null,null,null,null,{"$f":"IF(AND(G64>='A - Contractor Summary'!$C$36,G64<='A - Contractor Summary'!$C$38),\"Yes\",IF(G64<'A - Contractor Summary'!$C$36,\"No\",IF(G64>'A - Contractor Summary'!$C$39,\"\",\"\")))","v":"No"},{"$f":"IF(OR(N64=\"Yes\",N64=\"No\")*AND(G64<'A - Contractor Summary'!$C$39),\"\",IF(AND(G64>'A - Contractor Summary'!$C$39,G64<'A - Contractor Summary'!$C$42),\"Yes\",IF(G64>'A - Contractor Summary'!$C$42,\"No\",\"Needs Review\")))","v":""},"Yes","No",0,0]
[null,53,null,null,null,null,null,null,null,null,null,null,null,{"$f":"IF(AND(G65>='A - Contractor Summary'!$C$36,G65<='A - Contractor Summary'!$C$38),\"Yes\",IF(G65<'A - Contractor Summary'!$C$36,\"No\",IF(G65>'A - Contractor Summary'!$C$39,\"\",\"\")))","v":"No"},{"$f":"IF(OR(N65=\"Yes\",N65=\"No\")*AND(G65<'A - Contractor Summary'!$C$39),\"\",IF(AND(G65>'A - Contractor Summary'!$C$39,G65<'A - Contractor Summary'!$C$42),\"Yes\",IF(G65>'A - Contractor Summary'!$C$42,\"No\",\"Needs Review\")))","v":""},"Yes","No",0,0]
[null,54,null,null,null,null,null,null,null,null,null,null,null,{"$f":"IF(AND(G66>='A - Contractor Summary'!$C$36,G66<='A - Contractor Summary'!$C$38),\"Yes\",IF(G66<'A - Contractor Summary'!$C$36,\"No\",IF(G66>'A - Contractor Summary'!$C$39,\"\",\"\")))","v":"No"},{"$f":"IF(OR(N66=\"Yes\",N66=\"No\")*AND(G66<'A - Contractor Summary'!$C$39),\"\",IF(AND(G66>'A - Contractor Summary'!$C$39,G66<'A - Contractor Summary'!$C$42),\"Yes\",IF(G66>'A - Contractor Summary'!$C$42,\"No\",\"Needs Review\")))","v":""},"Yes","No",0,0]
[null,55,null,null,null,null,null,null,null,null,null,null,null,{"$f":"IF(AND(G67>='A - Contractor Summary'!$C$36,G67<='A - Contractor Summary'!$C$38),\"Yes\",IF(G67<'A - Contractor Summary'!$C$36,\"No\",IF(G67>'A - Contractor Summary'!$C$39,\"\",\"\")))","v":"No"},{"$f":"IF(OR(N67=\"Yes\",N67=\"No\")*AND(G67<'A - Contractor Summary'!$C$39),\"\",IF(AND(G67>'A - Contractor Summary'!$C$39,G67<'A - Contractor Summary'!$C$42),\"Yes\",IF(G67>'A - Contractor Summary'!$C$42,\"No\",\"Needs Review\")))","v":""},"Yes","No",0,0]
[null,56,null,null,null,null,null,null,null,null,null,null,null,{"$f":"IF(AND(G68>='A - Contractor Summary'!$C$36,G68<='A - Contractor Summary'!$C$38),\"Yes\",IF(G68<'A - Contractor Summary'!$C$36,\"No\",IF(G68>'A - Contractor Summary'!$C$39,\"\",\"\")))","v":"No"},{"$f":"IF(OR(N68=\"Yes\",N68=\"No\")*AND(G68<'A - Contractor Summary'!$C$39),\"\",IF(AND(G68>'A - Contractor Summary'!$C$39,G68<'A - Contractor Summary'!$C$42),\"Yes\",IF(G68>'A - Contractor Summary'!$C$42,\"No\",\"Needs Review\")))","v":""},"Yes","No",0,0]
[null,57,null,null,null,null,null,null,null,null,null,null,null,{"$f":"IF(AND(G69>='A - Contractor Summary'!$C$36,G69<='A - Contractor Summary'!$C$38),\"Yes\",IF(G69<'A - Contractor Summary'!$C$36,\"No\",IF(G69>'A - Contractor Summary'!$C$39,\"\",\"\")))","v":"No"},{"$f":"IF(OR(N69=\"Yes\",N69=\"No\")*AND(G69<'A - Contractor Summary'!$C$39),\"\",IF(AND(G69>'A - Contractor Summary'!$C$39,G69<'A - Contractor Summary'!$C$42),\"Yes\",IF(G69>'A - Contractor Summary'!$C$42,\"No\",\"Needs Review\")))","v":""},"Yes","No",0,0]
[null,58,null,null,null,null,null,null,null,null,null,null,null,{"$f":"IF(AND(G70>='A - Contractor Summary'!$C$36,G70<='A - Contractor Summary'!$C$38),\"Yes\",IF(G70<'A - Contractor Summary'!$C$36,\"No\",IF(G70>'A - Contractor Summary'!$C$39,\"\",\"\")))","v":"No"},{"$f":"IF(OR(N70=\"Yes\",N70=\"No\")*AND(G70<'A - Contractor Summary'!$C$39),\"\",IF(AND(G70>'A - Contractor Summary'!$C$39,G70<'A - Contractor Summary'!$C$42),\"Yes\",IF(G70>'A - Contractor Summary'!$C$42,\"No\",\"Needs Review\")))","v":""},"No","Needs Review",0,0]
[null,59,null,null,null,null,null,null,null,null,null,null,null,{"$f":"IF(AND(G71>='A - Contractor Summary'!$C$36,G71<='A - Contractor Summary'!$C$38),\"Yes\",IF(G71<'A - Contractor Summary'!$C$36,\"No\",IF(G71>'A - Contractor Summary'!$C$39,\"\",\"\")))","v":"No"},{"$f":"IF(OR(N71=\"Yes\",N71=\"No\")*AND(G71<'A - Contractor Summary'!$C$39),\"\",IF(AND(G71>'A - Contractor Summary'!$C$39,G71<'A - Contractor Summary'!$C$42),\"Yes\",IF(G71>'A - Contractor Summary'!$C$42,\"No\",\"Needs Review\")))","v":""},"Yes","No",0,0]
[null,61,null,null,null,null,null,null,null,null,null,null,null,{"$f":"IF(AND(G72>='A - Contractor Summary'!$C$36,G72<='A - Contractor Summary'!$C$38),\"Yes\",IF(G72<'A - Contractor Summary'!$C$36,\"No\",IF(G72>'A - Contractor Summary'!$C$39,\"\",\"\")))","v":"No"},{"$f":"IF(OR(N72=\"Yes\",N72=\"No\")*AND(G72<'A - Contractor Summary'!$C$39),\"\",IF(AND(G72>'A - Contractor Summary'!$C$39,G72<'A - Contractor Summary'!$C$42),\"Yes\",IF(G72>'A - Contractor Summary'!$C$42,\"No\",\"Needs Review\")))","v":""},"Yes","No",0,0]
[null,62,null,null,null,null,null,null,null,null,null,null,null,{"$f":"IF(AND(G73>='A - Contractor Summary'!$C$36,G73<='A - Contractor Summary'!$C$38),\"Yes\",IF(G73<'A - Contractor Summary'!$C$36,\"No\",IF(G73>'A - Contractor Summary'!$C$39,\"\",\"\")))","v":"No"},{"$f":"IF(OR(N73=\"Yes\",N73=\"No\")*AND(G73<'A - Contractor Summary'!$C$39),\"\",IF(AND(G73>'A - Contractor Summary'!$C$39,G73<'A - Contractor Summary'!$C$42),\"Yes\",IF(G73>'A - Contractor Summary'!$C$42,\"No\",\"Needs Review\")))","v":""},"Yes","No",0,0]
[null,63,null,null,null,null,null,null,null,null,null,null,null,{"$f":"IF(AND(G74>='A - Contractor Summary'!$C$36,G74<='A - Contractor Summary'!$C$38),\"Yes\",IF(G74<'A - Contractor Summary'!$C$36,\"No\",IF(G74>'A - Contractor Summary'!$C$39,\"\",\"\")))","v":"No"},{"$f":"IF(OR(N74=\"Yes\",N74=\"No\")*AND(G74<'A - Contractor Summary'!$C$39),\"\",IF(AND(G74>'A - Contractor Summary'!$C$39,G74<'A - Contractor Summary'!$C$42),\"Yes\",IF(G74>'A - Contractor Summary'!$C$42,\"No\",\"Needs Review\")))","v":""},"Yes","No",0,0]
[null,64,null,null,null,null,null,null,null,null,null,null,null,{"$f":"IF(AND(G75>='A - Contractor Summary'!$C$36,G75<='A - Contractor Summary'!$C$38),\"Yes\",IF(G75<'A - Contractor Summary'!$C$36,\"No\",IF(G75>'A - Contractor Summary'!$C$39,\"\",\"\")))","v":"No"},{"$f":"IF(OR(N75=\"Yes\",N75=\"No\")*AND(G75<'A - Contractor Summary'!$C$39),\"\",IF(AND(G75>'A - Contractor Summary'!$C$39,G75<'A - Contractor Summary'!$C$42),\"Yes\",IF(G75>'A - Contractor Summary'!$C$42,\"No\",\"Needs Review\")))","v":""},"Yes","No",0,0]
[null,65,null,null,null,null,null,null,null,null,null,null,null,{"$f":"IF(AND(G76>='A - Contractor Summary'!$C$36,G76<='A - Contractor Summary'!$C$38),\"Yes\",IF(G76<'A - Contractor Summary'!$C$36,\"No\",IF(G76>'A - Contractor Summary'!$C$39,\"\",\"\")))","v":"No"},{"$f":"IF(OR(N76=\"Yes\",N76=\"No\")*AND(G76<'A - Contractor Summary'!$C$39),\"\",IF(AND(G76>'A - Contractor Summary'!$C$39,G76<'A - Contractor Summary'!$C$42),\"Yes\",IF(G76>'A - Contractor Summary'!$C$42,\"No\",\"Needs Review\")))","v":""},"No","No",0,0]
[null,66,null,null,null,null,null,null,null,null,null,null,null,{"$f":"IF(AND(G77>='A - Contractor Summary'!$C$36,G77<='A - Contractor Summary'!$C$38),\"Yes\",IF(G77<'A - Contractor Summary'!$C$36,\"No\",IF(G77>'A - Contractor Summary'!$C$39,\"\",\"\")))","v":"No"},{"$f":"IF(OR(N77=\"Yes\",N77=\"No\")*AND(G77<'A - Contractor Summary'!$C$39),\"\",IF(AND(G77>'A - Contractor Summary'!$C$39,G77<'A - Contractor Summary'!$C$42),\"Yes\",IF(G77>'A - Contractor Summary'!$C$42,\"No\",\"Needs Review\")))","v":""},"Yes","No",0,0]
[null,67,null,null,null,null,null,null,null,null,null,null,null,{"$f":"IF(AND(G78>='A - Contractor Summary'!$C$36,G78<='A - Contractor Summary'!$C$38),\"Yes\",IF(G78<'A - Contractor Summary'!$C$36,\"No\",IF(G78>'A - Contractor Summary'!$C$39,\"\",\"\")))","v":"No"},{"$f":"IF(OR(N78=\"Yes\",N78=\"No\")*AND(G78<'A - Contractor Summary'!$C$39),\"\",IF(AND(G78>'A - Contractor Summary'!$C$39,G78<'A - Contractor Summary'!$C$42),\"Yes\",IF(G78>'A - Contractor Summary'!$C$42,\"No\",\"Needs Review\")))","v":""},"No","Needs Review",{"$f":"IF(Q78=\"Yes\",K78,0)","v":0},{"$f":"IF(Q78=\"Needs Review\",K78,0)","v":0}]
[null,68,null,null,null,null,null,null,null,null,null,null,null,{"$f":"IF(AND(G79>='A - Contractor Summary'!$C$36,G79<='A - Contractor Summary'!$C$38),\"Yes\",IF(G79<'A - Contractor Summary'!$C$36,\"No\",IF(G79>'A - Contractor Summary'!$C$39,\"\",\"\")))","v":"No"},{"$f":"IF(OR(N79=\"Yes\",N79=\"No\")*AND(G79<'A - Contractor Summary'!$C$39),\"\",IF(AND(G79>'A - Contractor Summary'!$C$39,G79<'A - Contractor Summary'!$C$42),\"Yes\",IF(G79>'A - Contractor Summary'!$C$42,\"No\",\"Needs Review\")))","v":""},"Yes",{"$f":"IF(AND(P79=\"Yes\",L79=\"Yes\",M79=\"Yes\")*OR(O79=\"Yes\",N79=\"Yes\"),\"Yes\",IF(OR(L79=\"No\",N79=\"No\",O79=\"No\",P79=\"No\",M79=\"No\"),\"No\",\"Needs Review\"))","v":"No"},0,0]
[null,69,null,null,null,null,null,null,null,null,null,null,null,{"$f":"IF(AND(G80>='A - Contractor Summary'!$C$36,G80<='A - Contractor Summary'!$C$38),\"Yes\",IF(G80<'A - Contractor Summary'!$C$36,\"No\",IF(G80>'A - Contractor Summary'!$C$39,\"\",\"\")))","v":"No"},{"$f":"IF(OR(N80=\"Yes\",N80=\"No\")*AND(G80<'A - Contractor Summary'!$C$39),\"\",IF(AND(G80>'A - Contractor Summary'!$C$39,G80<'A - Contractor Summary'!$C$42),\"Yes\",IF(G80>'A - Contractor Summary'!$C$42,\"No\",\"Needs Review\")))","v":""},"Yes","No",0,0]
[null,70,null,null,null,null,null,null,null,null,null,null,null,{"$f":"IF(AND(G81>='A - Contractor Summary'!$C$36,G81<='A - Contractor Summary'!$C$38),\"Yes\",IF(G81<'A - Contractor Summary'!$C$36,\"No\",IF(G81>'A - Contractor Summary'!$C$39,\"\",\"\")))","v":"No"},{"$f":"IF(OR(N81=\"Yes\",N81=\"No\")*AND(G81<'A - Contractor Summary'!$C$39),\"\",IF(AND(G81>'A - Contractor Summary'!$C$39,G81<'A - Contractor Summary'!$C$42),\"Yes\",IF(G81>'A - Contractor Summary'!$C$42,\"No\",\"Needs Review\")))","v":""},"Yes","No",0,0]
[null,71,null,null,null,null,null,null,null,null,null,null,null,{"$f":"IF(AND(G82>='A - Contractor Summary'!$C$36,G82<='A - Contractor Summary'!$C$38),\"Yes\",IF(G82<'A - Contractor Summary'!$C$36,\"No\",IF(G82>'A - Contractor Summary'!$C$39,\"\",\"\")))","v":"No"},{"$f":"IF(OR(N82=\"Yes\",N82=\"No\")*AND(G82<'A - Contractor Summary'!$C$39),\"\",IF(AND(G82>'A - Contractor Summary'!$C$39,G82<'A - Contractor Summary'!$C$42),\"Yes\",IF(G82>'A - Contractor Summary'!$C$42,\"No\",\"Needs Review\")))","v":""},"Yes","No",0,0]
[null,72,null,null,null,null,null,null,null,null,null,null,null,{"$f":"IF(AND(G83>='A - Contractor Summary'!$C$36,G83<='A - Contractor Summary'!$C$38),\"Yes\",IF(G83<'A - Contractor Summary'!$C$36,\"No\",IF(G83>'A - Contractor Summary'!$C$39,\"\",\"\")))","v":"No"},{"$f":"IF(OR(N83=\"Yes\",N83=\"No\")*AND(G83<'A - Contractor Summary'!$C$39),\"\",IF(AND(G83>'A - Contractor Summary'!$C$39,G83<'A - Contractor Summary'!$C$42),\"Yes\",IF(G83>'A - Contractor Summary'!$C$42,\"No\",\"Needs Review\")))","v":""},"Yes","No",0,0]
[null,73,null,null,null,null,null,null,null,null,null,null,null,{"$f":"IF(AND(G84>='A - Contractor Summary'!$C$36,G84<='A - Contractor Summary'!$C$38),\"Yes\",IF(G84<'A - Contractor Summary'!$C$36,\"No\",IF(G84>'A - Contractor Summary'!$C$39,\"\",\"\")))","v":"No"},{"$f":"IF(OR(N84=\"Yes\",N84=\"No\")*AND(G84<'A - Contractor Summary'!$C$39),\"\",IF(AND(G84>'A - Contractor Summary'!$C$39,G84<'A - Contractor Summary'!$C$42),\"Yes\",IF(G84>'A - Contractor Summary'!$C$42,\"No\",\"Needs Review\")))","v":""},"No","Needs Review",0,0]
[null,74,null,null,null,null,null,null,null,null,null,null,null,{"$f":"IF(AND(G85>='A - Contractor Summary'!$C$36,G85<='A - Contractor Summary'!$C$38),\"Yes\",IF(G85<'A - Contractor Summary'!$C$36,\"No\",IF(G85>'A - Contractor Summary'!$C$39,\"\",\"\")))","v":"No"},{"$f":"IF(OR(N85=\"Yes\",N85=\"No\")*AND(G85<'A - Contractor Summary'!$C$39),\"\",IF(AND(G85>'A - Contractor Summary'!$C$39,G85<'A - Contractor Summary'!$C$42),\"Yes\",IF(G85>'A - Contractor Summary'!$C$42,\"No\",\"Needs Review\")))","v":""},"No","No",0,0]
[null,75,null,null,null,null,null,null,null,null,null,null,null,{"$f":"IF(AND(G86>='A - Contractor Summary'!$C$36,G86<='A - Contractor Summary'!$C$38),\"Yes\",IF(G86<'A - Contractor Summary'!$C$36,\"No\",IF(G86>'A - Contractor Summary'!$C$39,\"\",\"\")))","v":"No"},{"$f":"IF(OR(N86=\"Yes\",N86=\"No\")*AND(G86<'A - Contractor Summary'!$C$39),\"\",IF(AND(G86>'A - Contractor Summary'!$C$39,G86<'A - Contractor Summary'!$C$42),\"Yes\",IF(G86>'A - Contractor Summary'!$C$42,\"No\",\"Needs Review\")))","v":""},"Yes","No",0,0]
[null,76,null,null,null,null,null,null,null,null,null,null,null,{"$f":"IF(AND(G87>='A - Contractor Summary'!$C$36,G87<='A - Contractor Summary'!$C$38),\"Yes\",IF(G87<'A - Contractor Summary'!$C$36,\"No\",IF(G87>'A - Contractor Summary'!$C$39,\"\",\"\")))","v":"No"},{"$f":"IF(OR(N87=\"Yes\",N87=\"No\")*AND(G87<'A - Contractor Summary'!$C$39),\"\",IF(AND(G87>'A - Contractor Summary'!$C$39,G87<'A - Contractor Summary'!$C$42),\"Yes\",IF(G87>'A - Contractor Summary'!$C$42,\"No\",\"Needs Review\")))","v":""},"Yes","No",0,0]
[null,77,null,null,null,null,null,null,null,null,null,null,null,{"$f":"IF(AND(G88>='A - Contractor Summary'!$C$36,G88<='A - Contractor Summary'!$C$38),\"Yes\",IF(G88<'A - Contractor Summary'!$C$36,\"No\",IF(G88>'A - Contractor Summary'!$C$39,\"\",\"\")))","v":"No"},{"$f":"IF(OR(N88=\"Yes\",N88=\"No\")*AND(G88<'A - Contractor Summary'!$C$39),\"\",IF(AND(G88>'A - Contractor Summary'!$C$39,G88<'A - Contractor Summary'!$C$42),\"Yes\",IF(G88>'A - Contractor Summary'!$C$42,\"No\",\"Needs Review\")))","v":""},"Yes","No",0,0]
[null,78,null,null,null,null,null,null,null,null,null,null,null,{"$f":"IF(AND(G89>='A - Contractor Summary'!$C$36,G89<='A - Contractor Summary'!$C$38),\"Yes\",IF(G89<'A - Contractor Summary'!$C$36,\"No\",IF(G89>'A - Contractor Summary'!$C$39,\"\",\"\")))","v":"No"},{"$f":"IF(OR(N89=\"Yes\",N89=\"No\")*AND(G89<'A - Contractor Summary'!$C$39),\"\",IF(AND(G89>'A - Contractor Summary'!$C$39,G89<'A - Contractor Summary'!$C$42),\"Yes\",IF(G89>'A - Contractor Summary'!$C$42,\"No\",\"Needs Review\")))","v":""},"Yes","No",0,0]
[null,79,null,null,null,null,null,null,null,null,null,null,null,{"$f":"IF(AND(G90>='A - Contractor Summary'!$C$36,G90<='A - Contractor Summary'!$C$38),\"Yes\",IF(G90<'A - Contractor Summary'!$C$36,\"No\",IF(G90>'A - Contractor Summary'!$C$39,\"\",\"\")))","v":"No"},{"$f":"IF(OR(N90=\"Yes\",N90=\"No\")*AND(G90<'A - Contractor Summary'!$C$39),\"\",IF(AND(G90>'A - Contractor Summary'!$C$39,G90<'A - Contractor Summary'!$C$42),\"Yes\",IF(G90>'A - Contractor Summary'!$C$42,\"No\",\"Needs Review\")))","v":""},"Yes","No",0,0]
[null,80,null,null,null,null,null,null,null,null,null,null,null,{"$f":"IF(AND(G91>='A - Contractor Summary'!$C$36,G91<='A - Contractor Summary'!$C$38),\"Yes\",IF(G91<'A - Contractor Summary'!$C$36,\"No\",IF(G91>'A - Contractor Summary'!$C$39,\"\",\"\")))","v":"No"},{"$f":"IF(OR(N91=\"Yes\",N91=\"No\")*AND(G91<'A - Contractor Summary'!$C$39),\"\",IF(AND(G91>'A - Contractor Summary'!$C$39,G91<'A - Contractor Summary'!$C$42),\"Yes\",IF(G91>'A - Contractor Summary'!$C$42,\"No\",\"Needs Review\")))","v":""},"No","No",0,0]
[null,81,null,null,null,null,null,null,null,null,null,null,null,{"$f":"IF(AND(G92>='A - Contractor Summary'!$C$36,G92<='A - Contractor Summary'!$C$38),\"Yes\",IF(G92<'A - Contractor Summary'!$C$36,\"No\",IF(G92>'A - Contractor Summary'!$C$39,\"\",\"\")))","v":"No"},{"$f":"IF(OR(N92=\"Yes\",N92=\"No\")*AND(G92<'A - Contractor Summary'!$C$39),\"\",IF(AND(G92>'A - Contractor Summary'!$C$39,G92<'A - Contractor Summary'!$C$42),\"Yes\",IF(G92>'A - Contractor Summary'!$C$42,\"No\",\"Needs Review\")))","v":""},"No","No",0,0]
[null,82,null,null,null,null,null,null,null,null,null,null,null,{"$f":"IF(AND(G93>='A - Contractor Summary'!$C$36,G93<='A - Contractor Summary'!$C$38),\"Yes\",IF(G93<'A - Contractor Summary'!$C$36,\"No\",IF(G93>'A - Contractor Summary'!$C$39,\"\",\"\")))","v":"No"},{"$f":"IF(OR(N93=\"Yes\",N93=\"No\")*AND(G93<'A - Contractor Summary'!$C$39),\"\",IF(AND(G93>'A - Contractor Summary'!$C$39,G93<'A - Contractor Summary'!$C$42),\"Yes\",IF(G93>'A - Contractor Summary'!$C$42,\"No\",\"Needs Review\")))","v":""},"No","No",0,0]
[null,83,null,null,null,null,null,null,null,null,null,null,null,{"$f":"IF(AND(G94>='A - Contractor Summary'!$C$36,G94<='A - Contractor Summary'!$C$38),\"Yes\",IF(G94<'A - Contractor Summary'!$C$36,\"No\",IF(G94>'A - Contractor Summary'!$C$39,\"\",\"\")))","v":"No"},{"$f":"IF(OR(N94=\"Yes\",N94=\"No\")*AND(G94<'A - Contractor Summary'!$C$39),\"\",IF(AND(G94>'A - Contractor Summary'!$C$39,G94<'A - Contractor Summary'!$C$42),\"Yes\",IF(G94>'A - Contractor Summary'!$C$42,\"No\",\"Needs Review\")))","v":""},"No",{"$f":"IF(AND(P94=\"Yes\",L94=\"Yes\",M94=\"Yes\")*OR(O94=\"Yes\",N94=\"Yes\"),\"Yes\",IF(OR(L94=\"No\",N94=\"No\",O94=\"No\",P94=\"No\",M94=\"No\"),\"No\",\"Needs Review\"))","v":"No"},{"$f":"IF(Q94=\"Yes\",K94,0)","v":0},{"$f":"IF(Q94=\"Needs Review\",K94,0)","v":0}]
[null,84,null,null,null,null,null,null,null,null,null,null,null,{"$f":"IF(AND(G95>='A - Contractor Summary'!$C$36,G95<='A - Contractor Summary'!$C$38),\"Yes\",IF(G95<'A - Contractor Summary'!$C$36,\"No\",IF(G95>'A - Contractor Summary'!$C$39,\"\",\"\")))","v":"No"},{"$f":"IF(OR(N95=\"Yes\",N95=\"No\")*AND(G95<'A - Contractor Summary'!$C$39),\"\",IF(AND(G95>'A - Contractor Summary'!$C$39,G95<'A - Contractor Summary'!$C$42),\"Yes\",IF(G95>'A - Contractor Summary'!$C$42,\"No\",\"Needs Review\")))","v":""},"No","No",0,0]
[null,85,null,null,null,null,null,null,null,null,null,null,null,{"$f":"IF(AND(G96>='A - Contractor Summary'!$C$36,G96<='A - Contractor Summary'!$C$38),\"Yes\",IF(G96<'A - Contractor Summary'!$C$36,\"No\",IF(G96>'A - Contractor Summary'!$C$39,\"\",\"\")))","v":"No"},{"$f":"IF(OR(N96=\"Yes\",N96=\"No\")*AND(G96<'A - Contractor Summary'!$C$39),\"\",IF(AND(G96>'A - Contractor Summary'!$C$39,G96<'A - Contractor Summary'!$C$42),\"Yes\",IF(G96>'A - Contractor Summary'!$C$42,\"No\",\"Needs Review\")))","v":""},"No","No",0,0]
[null,86,null,null,null,null,null,null,null,null,null,null,null,{"$f":"IF(AND(G97>='A - Contractor Summary'!$C$36,G97<='A - Contractor Summary'!$C$38),\"Yes\",IF(G97<'A - Contractor Summary'!$C$36,\"No\",IF(G97>'A - Contractor Summary'!$C$39,\"\",\"\")))","v":"No"},{"$f":"IF(OR(N97=\"Yes\",N97=\"No\")*AND(G97<'A - Contractor Summary'!$C$39),\"\",IF(AND(G97>'A - Contractor Summary'!$C$39,G97<'A - Contractor Summary'!$C$42),\"Yes\",IF(G97>'A - Contractor Summary'!$C$42,\"No\",\"Needs Review\")))","v":""},"Yes","No",0,0]
[null,87,null,null,null,null,null,null,null,null,null,null,null,{"$f":"IF(AND(G98>='A - Contractor Summary'!$C$36,G98<='A - Contractor Summary'!$C$38),\"Yes\",IF(G98<'A - Contractor Summary'!$C$36,\"No\",IF(G98>'A - Contractor Summary'!$C$39,\"\",\"\")))","v":"No"},{"$f":"IF(OR(N98=\"Yes\",N98=\"No\")*AND(G98<'A - Contractor Summary'!$C$39),\"\",IF(AND(G98>'A - Contractor Summary'!$C$39,G98<'A - Contractor Summary'!$C$42),\"Yes\",IF(G98>'A - Contractor Summary'!$C$42,\"No\",\"Needs Review\")))","v":""},"Yes","No",0,0]
[null,88,null,null,null,null,null,null,null,null,null,null,null,{"$f":"IF(AND(G99>='A - Contractor Summary'!$C$36,G99<='A - Contractor Summary'!$C$38),\"Yes\",IF(G99<'A - Contractor Summary'!$C$36,\"No\",IF(G99>'A - Contractor Summary'!$C$39,\"\",\"\")))","v":"No"},{"$f":"IF(OR(N99=\"Yes\",N99=\"No\")*AND(G99<'A - Contractor Summary'!$C$39),\"\",IF(AND(G99>'A - Contractor Summary'!$C$39,G99<'A - Contractor Summary'!$C$42),\"Yes\",IF(G99>'A - Contractor Summary'!$C$42,\"No\",\"Needs Review\")))","v":""},"Yes","No",0,0]
[null,89,null,null,null,null,null,null,null,null,null,null,null,{"$f":"IF(AND(G100>='A - Contractor Summary'!$C$36,G100<='A - Contractor Summary'!$C$38),\"Yes\",IF(G100<'A - Contractor Summary'!$C$36,\"No\",IF(G100>'A - Contractor Summary'!$C$39,\"\",\"\")))","v":"No"},{"$f":"IF(OR(N100=\"Yes\",N100=\"No\")*AND(G100<'A - Contractor Summary'!$C$39),\"\",IF(AND(G100>'A - Contractor Summary'!$C$39,G100<'A - Contractor Summary'!$C$42),\"Yes\",IF(G100>'A - Contractor Summary'!$C$42,\"No\",\"Needs Review\")))","v":""},"Yes","No",0,0]
[null,90,null,null,null,null,null,null,null,null,null,null,null,{"$f":"IF(AND(G101>='A - Contractor Summary'!$C$36,G101<='A - Contractor Summary'!$C$38),\"Yes\",IF(G101<'A - Contractor Summary'!$C$36,\"No\",IF(G101>'A - Contractor Summary'!$C$39,\"\",\"\")))","v":"No"},{"$f":"IF(OR(N101=\"Yes\",N101=\"No\")*AND(G101<'A - Contractor Summary'!$C$39),\"\",IF(AND(G101>'A - Contractor Summary'!$C$39,G101<'A - Contractor Summary'!$C$42),\"Yes\",IF(G101>'A - Contractor Summary'!$C$42,\"No\",\"Needs Review\")))","v":""},"Yes","No",0,0]
[null,91,null,null,null,null,null,null,null,null,null,null,null,{"$f":"IF(AND(G102>='A - Contractor Summary'!$C$36,G102<='A - Contractor Summary'!$C$38),\"Yes\",IF(G102<'A - Contractor Summary'!$C$36,\"No\",IF(G102>'A - Contractor Summary'!$C$39,\"\",\"\")))","v":"No"},{"$f":"IF(OR(N102=\"Yes\",N102=\"No\")*AND(G102<'A - Contractor Summary'!$C$39),\"\",IF(AND(G102>'A - Contractor Summary'!$C$39,G102<'A - Contractor Summary'!$C$42),\"Yes\",IF(G102>'A - Contractor Summary'!$C$42,\"No\",\"Needs Review\")))","v":""},"Yes","No",0,0]
[null,92,null,null,null,null,null,null,null,null,null,null,null,{"$f":"IF(AND(G103>='A - Contractor Summary'!$C$36,G103<='A - Contractor Summary'!$C$38),\"Yes\",IF(G103<'A - Contractor Summary'!$C$36,\"No\",IF(G103>'A - Contractor Summary'!$C$39,\"\",\"\")))","v":"No"},{"$f":"IF(OR(N103=\"Yes\",N103=\"No\")*AND(G103<'A - Contractor Summary'!$C$39),\"\",IF(AND(G103>'A - Contractor Summary'!$C$39,G103<'A - Contractor Summary'!$C$42),\"Yes\",IF(G103>'A - Contractor Summary'!$C$42,\"No\",\"Needs Review\")))","v":""},"Yes","No",0,0]
[null,93,null,null,null,null,null,null,null,null,null,null,null,{"$f":"IF(AND(G104>='A - Contractor Summary'!$C$36,G104<='A - Contractor Summary'!$C$38),\"Yes\",IF(G104<'A - Contractor Summary'!$C$36,\"No\",IF(G104>'A - Contractor Summary'!$C$39,\"\",\"\")))","v":"No"},{"$f":"IF(OR(N104=\"Yes\",N104=\"No\")*AND(G104<'A - Contractor Summary'!$C$39),\"\",IF(AND(G104>'A - Contractor Summary'!$C$39,G104<'A - Contractor Summary'!$C$42),\"Yes\",IF(G104>'A - Contractor Summary'!$C$42,\"No\",\"Needs Review\")))","v":""},"Yes","No",0,0]
[null,94,null,null,null,null,null,null,null,null,null,null,null,{"$f":"IF(AND(G105>='A - Contractor Summary'!$C$36,G105<='A - Contractor Summary'!$C$38),\"Yes\",IF(G105<'A - Contractor Summary'!$C$36,\"No\",IF(G105>'A - Contractor Summary'!$C$39,\"\",\"\")))","v":"No"},{"$f":"IF(OR(N105=\"Yes\",N105=\"No\")*AND(G105<'A - Contractor Summary'!$C$39),\"\",IF(AND(G105>'A - Contractor Summary'!$C$39,G105<'A - Contractor Summary'!$C$42),\"Yes\",IF(G105>'A - Contractor Summary'!$C$42,\"No\",\"Needs Review\")))","v":""},"Yes","No",0,0]
[null,95,null,null,null,null,null,null,null,null,null,null,null,{"$f":"IF(AND(G106>='A - Contractor Summary'!$C$36,G106<='A - Contractor Summary'!$C$38),\"Yes\",IF(G106<'A - Contractor Summary'!$C$36,\"No\",IF(G106>'A - Contractor Summary'!$C$39,\"\",\"\")))","v":"No"},{"$f":"IF(OR(N106=\"Yes\",N106=\"No\")*AND(G106<'A - Contractor Summary'!$C$39),\"\",IF(AND(G106>'A - Contractor Summary'!$C$39,G106<'A - Contractor Summary'!$C$42),\"Yes\",IF(G106>'A - Contractor Summary'!$C$42,\"No\",\"Needs Review\")))","v":""},"Yes","No",0,0]
[null,96,null,null,null,null,null,null,null,null,null,null,null,{"$f":"IF(AND(G107>='A - Contractor Summary'!$C$36,G107<='A - Contractor Summary'!$C$38),\"Yes\",IF(G107<'A - Contractor Summary'!$C$36,\"No\",IF(G107>'A - Contractor Summary'!$C$39,\"\",\"\")))","v":"No"},{"$f":"IF(OR(N107=\"Yes\",N107=\"No\")*AND(G107<'A - Contractor Summary'!$C$39),\"\",IF(AND(G107>'A - Contractor Summary'!$C$39,G107<'A - Contractor Summary'!$C$42),\"Yes\",IF(G107>'A - Contractor Summary'!$C$42,\"No\",\"Needs Review\")))","v":""},"Yes","No",0,0]
[null,97,null,null,null,null,null,null,null,null,null,null,null,{"$f":"IF(AND(G108>='A - Contractor Summary'!$C$36,G108<='A - Contractor Summary'!$C$38),\"Yes\",IF(G108<'A - Contractor Summary'!$C$36,\"No\",IF(G108>'A - Contractor Summary'!$C$39,\"\",\"\")))","v":"No"},{"$f":"IF(OR(N108=\"Yes\",N108=\"No\")*AND(G108<'A - Contractor Summary'!$C$39),\"\",IF(AND(G108>'A - Contractor Summary'!$C$39,G108<'A - Contractor Summary'!$C$42),\"Yes\",IF(G108>'A - Contractor Summary'!$C$42,\"No\",\"Needs Review\")))","v":""},"Yes","No",0,0]
[null,98,null,null,null,null,null,null,null,null,null,null,null,{"$f":"IF(AND(G109>='A - Contractor Summary'!$C$36,G109<='A - Contractor Summary'!$C$38),\"Yes\",IF(G109<'A - Contractor Summary'!$C$36,\"No\",IF(G109>'A - Contractor Summary'!$C$39,\"\",\"\")))","v":"No"},{"$f":"IF(OR(N109=\"Yes\",N109=\"No\")*AND(G109<'A - Contractor Summary'!$C$39),\"\",IF(AND(G109>'A - Contractor Summary'!$C$39,G109<'A - Contractor Summary'!$C$42),\"Yes\",IF(G109>'A - Contractor Summary'!$C$42,\"No\",\"Needs Review\")))","v":""},"Yes","No",0,0]
[null,99,null,null,null,null,null,null,null,null,null,null,null,{"$f":"IF(AND(G110>='A - Contractor Summary'!$C$36,G110<='A - Contractor Summary'!$C$38),\"Yes\",IF(G110<'A - Contractor Summary'!$C$36,\"No\",IF(G110>'A - Contractor Summary'!$C$39,\"\",\"\")))","v":"No"},{"$f":"IF(OR(N110=\"Yes\",N110=\"No\")*AND(G110<'A - Contractor Summary'!$C$39),\"\",IF(AND(G110>'A - Contractor Summary'!$C$39,G110<'A - Contractor Summary'!$C$42),\"Yes\",IF(G110>'A - Contractor Summary'!$C$42,\"No\",\"Needs Review\")))","v":""},"Yes","No",0,0]
[null,100,null,null,null,null,null,null,null,null,null,null,null,{"$f":"IF(AND(G111>='A - Contractor Summary'!$C$36,G111<='A - Contractor Summary'!$C$38),\"Yes\",IF(G111<'A - Contractor Summary'!$C$36,\"No\",IF(G111>'A - Contractor Summary'!$C$39,\"\",\"\")))","v":"No"},{"$f":"IF(OR(N111=\"Yes\",N111=\"No\")*AND(G111<'A - Contractor Summary'!$C$39),\"\",IF(AND(G111>'A - Contractor Summary'!$C$39,G111<'A - Contractor Summary'!$C$42),\"Yes\",IF(G111>'A - Contractor Summary'!$C$42,\"No\",\"Needs Review\")))","v":""},"Yes","No",0,0]
[null,101,null,null,null,null,null,null,null,null,null,null,null,{"$f":"IF(AND(G112>='A - Contractor Summary'!$C$36,G112<='A - Contractor Summary'!$C$38),\"Yes\",IF(G112<'A - Contractor Summary'!$C$36,\"No\",IF(G112>'A - Contractor Summary'!$C$39,\"\",\"\")))","v":"No"},{"$f":"IF(OR(N112=\"Yes\",N112=\"No\")*AND(G112<'A - Contractor Summary'!$C$39),\"\",IF(AND(G112>'A - Contractor Summary'!$C$39,G112<'A - Contractor Summary'!$C$42),\"Yes\",IF(G112>'A - Contractor Summary'!$C$42,\"No\",\"Needs Review\")))","v":""},"Yes","No",0,0]
[null,102,null,null,null,null,null,null,null,null,null,null,null,{"$f":"IF(AND(G113>='A - Contractor Summary'!$C$36,G113<='A - Contractor Summary'!$C$38),\"Yes\",IF(G113<'A - Contractor Summary'!$C$36,\"No\",IF(G113>'A - Contractor Summary'!$C$39,\"\",\"\")))","v":"No"},{"$f":"IF(OR(N113=\"Yes\",N113=\"No\")*AND(G113<'A - Contractor Summary'!$C$39),\"\",IF(AND(G113>'A - Contractor Summary'!$C$39,G113<'A - Contractor Summary'!$C$42),\"Yes\",IF(G113>'A - Contractor Summary'!$C$42,\"No\",\"Needs Review\")))","v":""},"Yes","No",0,0]
[null,103,null,null,null,null,null,null,null,null,null,null,null,{"$f":"IF(AND(G114>='A - Contractor Summary'!$C$36,G114<='A - Contractor Summary'!$C$38),\"Yes\",IF(G114<'A - Contractor Summary'!$C$36,\"No\",IF(G114>'A - Contractor Summary'!$C$39,\"\",\"\")))","v":"No"},{"$f":"IF(OR(N114=\"Yes\",N114=\"No\")*AND(G114<'A - Contractor Summary'!$C$39),\"\",IF(AND(G114>'A - Contractor Summary'!$C$39,G114<'A - Contractor Summary'!$C$42),\"Yes\",IF(G114>'A - Contractor Summary'!$C$42,\"No\",\"Needs Review\")))","v":""},"Yes","No",0,0]
[null,104,null,null,null,null,null,null,null,null,null,null,null,{"$f":"IF(AND(G115>='A - Contractor Summary'!$C$36,G115<='A - Contractor Summary'!$C$38),\"Yes\",IF(G115<'A - Contractor Summary'!$C$36,\"No\",IF(G115>'A - Contractor Summary'!$C$39,\"\",\"\")))","v":"No"},{"$f":"IF(OR(N115=\"Yes\",N115=\"No\")*AND(G115<'A - Contractor Summary'!$C$39),\"\",IF(AND(G115>'A - Contractor Summary'!$C$39,G115<'A - Contractor Summary'!$C$42),\"Yes\",IF(G115>'A - Contractor Summary'!$C$42,\"No\",\"Needs Review\")))","v":""},"Yes","No",0,0]
[null,105,null,null,null,null,null,null,null,null,null,null,null,{"$f":"IF(AND(G116>='A - Contractor Summary'!$C$36,G116<='A - Contractor Summary'!$C$38),\"Yes\",IF(G116<'A - Contractor Summary'!$C$36,\"No\",IF(G116>'A - Contractor Summary'!$C$39,\"\",\"\")))","v":"No"},{"$f":"IF(OR(N116=\"Yes\",N116=\"No\")*AND(G116<'A - Contractor Summary'!$C$39),\"\",IF(AND(G116>'A - Contractor Summary'!$C$39,G116<'A - Contractor Summary'!$C$42),\"Yes\",IF(G116>'A - Contractor Summary'!$C$42,\"No\",\"Needs Review\")))","v":""},"Yes","No",0,0]
[null,106,null,null,null,null,null,null,null,null,null,null,null,{"$f":"IF(AND(G117>='A - Contractor Summary'!$C$36,G117<='A - Contractor Summary'!$C$38),\"Yes\",IF(G117<'A - Contractor Summary'!$C$36,\"No\",IF(G117>'A - Contractor Summary'!$C$39,\"\",\"\")))","v":"No"},{"$f":"IF(OR(N117=\"Yes\",N117=\"No\")*AND(G117<'A - Contractor Summary'!$C$39),\"\",IF(AND(G117>'A - Contractor Summary'!$C$39,G117<'A - Contractor Summary'!$C$42),\"Yes\",IF(G117>'A - Contractor Summary'!$C$42,\"No\",\"Needs Review\")))","v":""},"Yes","No",0,0]
[null,107,null,null,null,null,null,null,null,null,null,null,null,{"$f":"IF(AND(G118>='A - Contractor Summary'!$C$36,G118<='A - Contractor Summary'!$C$38),\"Yes\",IF(G118<'A - Contractor Summary'!$C$36,\"No\",IF(G118>'A - Contractor Summary'!$C$39,\"\",\"\")))","v":"No"},{"$f":"IF(OR(N118=\"Yes\",N118=\"No\")*AND(G118<'A - Contractor Summary'!$C$39),\"\",IF(AND(G118>'A - Contractor Summary'!$C$39,G118<'A - Contractor Summary'!$C$42),\"Yes\",IF(G118>'A - Contractor Summary'!$C$42,\"No\",\"Needs Review\")))","v":""},"Yes","No",0,0]
[null,108,null,null,null,null,null,null,null,null,null,null,null,{"$f":"IF(AND(G119>='A - Contractor Summary'!$C$36,G119<='A - Contractor Summary'!$C$38),\"Yes\",IF(G119<'A - Contractor Summary'!$C$36,\"No\",IF(G119>'A - Contractor Summary'!$C$39,\"\",\"\")))","v":"No"},{"$f":"IF(OR(N119=\"Yes\",N119=\"No\")*AND(G119<'A - Contractor Summary'!$C$39),\"\",IF(AND(G119>'A - Contractor Summary'!$C$39,G119<'A - Contractor Summary'!$C$42),\"Yes\",IF(G119>'A - Contractor Summary'!$C$42,\"No\",\"Needs Review\")))","v":""},"Yes","No",0,0]
[null,109,null,null,null,null,null,null,null,null,null,null,null,{"$f":"IF(AND(G120>='A - Contractor Summary'!$C$36,G120<='A - Contractor Summary'!$C$38),\"Yes\",IF(G120<'A - Contractor Summary'!$C$36,\"No\",IF(G120>'A - Contractor Summary'!$C$39,\"\",\"\")))","v":"No"},{"$f":"IF(OR(N120=\"Yes\",N120=\"No\")*AND(G120<'A - Contractor Summary'!$C$39),\"\",IF(AND(G120>'A - Contractor Summary'!$C$39,G120<'A - Contractor Summary'!$C$42),\"Yes\",IF(G120>'A - Contractor Summary'!$C$42,\"No\",\"Needs Review\")))","v":""},"Yes","No",0,0]
[null,110,null,null,null,null,null,null,null,null,null,null,null,{"$f":"IF(AND(G121>='A - Contractor Summary'!$C$36,G121<='A - Contractor Summary'!$C$38),\"Yes\",IF(G121<'A - Contractor Summary'!$C$36,\"No\",IF(G121>'A - Contractor Summary'!$C$39,\"\",\"\")))","v":"No"},{"$f":"IF(OR(N121=\"Yes\",N121=\"No\")*AND(G121<'A - Contractor Summary'!$C$39),\"\",IF(AND(G121>'A - Contractor Summary'!$C$39,G121<'A - Contractor Summary'!$C$42),\"Yes\",IF(G121>'A - Contractor Summary'!$C$42,\"No\",\"Needs Review\")))","v":""},"Yes","No",0,0]
[null,111,null,null,null,null,null,null,null,null,null,null,null,{"$f":"IF(AND(G122>='A - Contractor Summary'!$C$36,G122<='A - Contractor Summary'!$C$38),\"Yes\",IF(G122<'A - Contractor Summary'!$C$36,\"No\",IF(G122>'A - Contractor Summary'!$C$39,\"\",\"\")))","v":"No"},{"$f":"IF(OR(N122=\"Yes\",N122=\"No\")*AND(G122<'A - Contractor Summary'!$C$39),\"\",IF(AND(G122>'A - Contractor Summary'!$C$39,G122<'A - Contractor Summary'!$C$42),\"Yes\",IF(G122>'A - Contractor Summary'!$C$42,\"No\",\"Needs Review\")))","v":""},"Yes","No",0,0]
[null,112,null,null,null,null,null,null,null,null,null,null,null,{"$f":"IF(AND(G123>='A - Contractor Summary'!$C$36,G123<='A - Contractor Summary'!$C$38),\"Yes\",IF(G123<'A - Contractor Summary'!$C$36,\"No\",IF(G123>'A - Contractor Summary'!$C$39,\"\",\"\")))","v":"No"},{"$f":"IF(OR(N123=\"Yes\",N123=\"No\")*AND(G123<'A - Contractor Summary'!$C$39),\"\",IF(AND(G123>'A - Contractor Summary'!$C$39,G123<'A - Contractor Summary'!$C$42),\"Yes\",IF(G123>'A - Contractor Summary'!$C$42,\"No\",\"Needs Review\")))","v":""},"Yes","No",0,0]
[null,113,null,null,null,null,null,null,null,null,null,null,null,{"$f":"IF(AND(G124>='A - Contractor Summary'!$C$36,G124<='A - Contractor Summary'!$C$38),\"Yes\",IF(G124<'A - Contractor Summary'!$C$36,\"No\",IF(G124>'A - Contractor Summary'!$C$39,\"\",\"\")))","v":"No"},{"$f":"IF(OR(N124=\"Yes\",N124=\"No\")*AND(G124<'A - Contractor Summary'!$C$39),\"\",IF(AND(G124>'A - Contractor Summary'!$C$39,G124<'A - Contractor Summary'!$C$42),\"Yes\",IF(G124>'A - Contractor Summary'!$C$42,\"No\",\"Needs Review\")))","v":""},"Yes","No",0,0]
[null,114,null,null,null,null,null,null,null,null,null,null,null,{"$f":"IF(AND(G125>='A - Contractor Summary'!$C$36,G125<='A - Contractor Summary'!$C$38),\"Yes\",IF(G125<'A - Contractor Summary'!$C$36,\"No\",IF(G125>'A - Contractor Summary'!$C$39,\"\",\"\")))","v":"No"},{"$f":"IF(OR(N125=\"Yes\",N125=\"No\")*AND(G125<'A - Contractor Summary'!$C$39),\"\",IF(AND(G125>'A - Contractor Summary'!$C$39,G125<'A - Contractor Summary'!$C$42),\"Yes\",IF(G125>'A - Contractor Summary'!$C$42,\"No\",\"Needs Review\")))","v":""},"Yes","No",0,0]
[null,115,null,null,null,null,null,null,null,null,null,null,null,{"$f":"IF(AND(G126>='A - Contractor Summary'!$C$36,G126<='A - Contractor Summary'!$C$38),\"Yes\",IF(G126<'A - Contractor Summary'!$C$36,\"No\",IF(G126>'A - Contractor Summary'!$C$39,\"\",\"\")))","v":"No"},{"$f":"IF(OR(N126=\"Yes\",N126=\"No\")*AND(G126<'A - Contractor Summary'!$C$39),\"\",IF(AND(G126>'A - Contractor Summary'!$C$39,G126<'A - Contractor Summary'!$C$42),\"Yes\",IF(G126>'A - Contractor Summary'!$C$42,\"No\",\"Needs Review\")))","v":""},"Yes","No",0,0]
[null,116,null,null,null,null,null,null,null,null,null,null,null,{"$f":"IF(AND(G127>='A - Contractor Summary'!$C$36,G127<='A - Contractor Summary'!$C$38),\"Yes\",IF(G127<'A - Contractor Summary'!$C$36,\"No\",IF(G127>'A - Contractor Summary'!$C$39,\"\",\"\")))","v":"No"},{"$f":"IF(OR(N127=\"Yes\",N127=\"No\")*AND(G127<'A - Contractor Summary'!$C$39),\"\",IF(AND(G127>'A - Contractor Summary'!$C$39,G127<'A - Contractor Summary'!$C$42),\"Yes\",IF(G127>'A - Contractor Summary'!$C$42,\"No\",\"Needs Review\")))","v":""},"Yes","No",0,0]
[null,117,null,null,null,null,null,null,null,null,null,null,null,{"$f":"IF(AND(G128>='A - Contractor Summary'!$C$36,G128<='A - Contractor Summary'!$C$38),\"Yes\",IF(G128<'A - Contractor Summary'!$C$36,\"No\",IF(G128>'A - Contractor Summary'!$C$39,\"\",\"\")))","v":"No"},{"$f":"IF(OR(N128=\"Yes\",N128=\"No\")*AND(G128<'A - Contractor Summary'!$C$39),\"\",IF(AND(G128>'A - Contractor Summary'!$C$39,G128<'A - Contractor Summary'!$C$42),\"Yes\",IF(G128>'A - Contractor Summary'!$C$42,\"No\",\"Needs Review\")))","v":""},"Yes","No",0,0]
[null,118,null,null,null,null,null,null,null,null,null,null,null,{"$f":"IF(AND(G129>='A - Contractor Summary'!$C$36,G129<='A - Contractor Summary'!$C$38),\"Yes\",IF(G129<'A - Contractor Summary'!$C$36,\"No\",IF(G129>'A - Contractor Summary'!$C$39,\"\",\"\")))","v":"No"},{"$f":"IF(OR(N129=\"Yes\",N129=\"No\")*AND(G129<'A - Contractor Summary'!$C$39),\"\",IF(AND(G129>'A - Contractor Summary'!$C$39,G129<'A - Contractor Summary'!$C$42),\"Yes\",IF(G129>'A - Contractor Summary'!$C$42,\"No\",\"Needs Review\")))","v":""},"Yes","No",0,0]
[null,119,null,null,null,null,null,null,null,null,null,null,null,{"$f":"IF(AND(G130>='A - Contractor Summary'!$C$36,G130<='A - Contractor Summary'!$C$38),\"Yes\",IF(G130<'A - Contractor Summary'!$C$36,\"No\",IF(G130>'A - Contractor Summary'!$C$39,\"\",\"\")))","v":"No"},{"$f":"IF(OR(N130=\"Yes\",N130=\"No\")*AND(G130<'A - Contractor Summary'!$C$39),\"\",IF(AND(G130>'A - Contractor Summary'!$C$39,G130<'A - Contractor Summary'!$C$42),\"Yes\",IF(G130>'A - Contractor Summary'!$C$42,\"No\",\"Needs Review\")))","v":""},"Yes","No",0,0]
[null,120,null,null,null,null,null,null,null,null,null,null,null,{"$f":"IF(AND(G131>='A - Contractor Summary'!$C$36,G131<='A - Contractor Summary'!$C$38),\"Yes\",IF(G131<'A - Contractor Summary'!$C$36,\"No\",IF(G131>'A - Contractor Summary'!$C$39,\"\",\"\")))","v":"No"},{"$f":"IF(OR(N131=\"Yes\",N131=\"No\")*AND(G131<'A - Contractor Summary'!$C$39),\"\",IF(AND(G131>'A - Contractor Summary'!$C$39,G131<'A - Contractor Summary'!$C$42),\"Yes\",IF(G131>'A - Contractor Summary'!$C$42,\"No\",\"Needs Review\")))","v":""},"Yes","No",0,0]
[null,121,null,null,null,null,null,null,null,null,null,null,null,{"$f":"IF(AND(G132>='A - Contractor Summary'!$C$36,G132<='A - Contractor Summary'!$C$38),\"Yes\",IF(G132<'A - Contractor Summary'!$C$36,\"No\",IF(G132>'A - Contractor Summary'!$C$39,\"\",\"\")))","v":"No"},{"$f":"IF(OR(N132=\"Yes\",N132=\"No\")*AND(G132<'A - Contractor Summary'!$C$39),\"\",IF(AND(G132>'A - Contractor Summary'!$C$39,G132<'A - Contractor Summary'!$C$42),\"Yes\",IF(G132>'A - Contractor Summary'!$C$42,\"No\",\"Needs Review\")))","v":""},"Yes","No",0,0]
[null,122,null,null,null,null,null,null,null,null,null,null,null,{"$f":"IF(AND(G133>='A - Contractor Summary'!$C$36,G133<='A - Contractor Summary'!$C$38),\"Yes\",IF(G133<'A - Contractor Summary'!$C$36,\"No\",IF(G133>'A - Contractor Summary'!$C$39,\"\",\"\")))","v":"No"},{"$f":"IF(OR(N133=\"Yes\",N133=\"No\")*AND(G133<'A - Contractor Summary'!$C$39),\"\",IF(AND(G133>'A - Contractor Summary'!$C$39,G133<'A - Contractor Summary'!$C$42),\"Yes\",IF(G133>'A - Contractor Summary'!$C$42,\"No\",\"Needs Review\")))","v":""},"Yes","No",0,0]
[null,123,null,null,null,null,null,null,null,null,null,null,null,{"$f":"IF(AND(G134>='A - Contractor Summary'!$C$36,G134<='A - Contractor Summary'!$C$38),\"Yes\",IF(G134<'A - Contractor Summary'!$C$36,\"No\",IF(G134>'A - Contractor Summary'!$C$39,\"\",\"\")))","v":"No"},{"$f":"IF(OR(N134=\"Yes\",N134=\"No\")*AND(G134<'A - Contractor Summary'!$C$39),\"\",IF(AND(G134>'A - Contractor Summary'!$C$39,G134<'A - Contractor Summary'!$C$42),\"Yes\",IF(G134>'A - Contractor Summary'!$C$42,\"No\",\"Needs Review\")))","v":""},"Yes","No",0,0]
[null,124,null,null,null,null,null,null,null,null,null,null,null,{"$f":"IF(AND(G135>='A - Contractor Summary'!$C$36,G135<='A - Contractor Summary'!$C$38),\"Yes\",IF(G135<'A - Contractor Summary'!$C$36,\"No\",IF(G135>'A - Contractor Summary'!$C$39,\"\",\"\")))","v":"No"},{"$f":"IF(OR(N135=\"Yes\",N135=\"No\")*AND(G135<'A - Contractor Summary'!$C$39),\"\",IF(AND(G135>'A - Contractor Summary'!$C$39,G135<'A - Contractor Summary'!$C$42),\"Yes\",IF(G135>'A - Contractor Summary'!$C$42,\"No\",\"Needs Review\")))","v":""},"Yes","No",0,0]
[null,125,null,null,null,null,null,null,null,null,null,null,null,{"$f":"IF(AND(G136>='A - Contractor Summary'!$C$36,G136<='A - Contractor Summary'!$C$38),\"Yes\",IF(G136<'A - Contractor Summary'!$C$36,\"No\",IF(G136>'A - Contractor Summary'!$C$39,\"\",\"\")))","v":"No"},{"$f":"IF(OR(N136=\"Yes\",N136=\"No\")*AND(G136<'A - Contractor Summary'!$C$39),\"\",IF(AND(G136>'A - Contractor Summary'!$C$39,G136<'A - Contractor Summary'!$C$42),\"Yes\",IF(G136>'A - Contractor Summary'!$C$42,\"No\",\"Needs Review\")))","v":""},"Yes","No",0,0]
[null,126,null,null,null,null,null,null,null,null,null,null,null,{"$f":"IF(AND(G137>='A - Contractor Summary'!$C$36,G137<='A - Contractor Summary'!$C$38),\"Yes\",IF(G137<'A - Contractor Summary'!$C$36,\"No\",IF(G137>'A - Contractor Summary'!$C$39,\"\",\"\")))","v":"No"},{"$f":"IF(OR(N137=\"Yes\",N137=\"No\")*AND(G137<'A - Contractor Summary'!$C$39),\"\",IF(AND(G137>'A - Contractor Summary'!$C$39,G137<'A - Contractor Summary'!$C$42),\"Yes\",IF(G137>'A - Contractor Summary'!$C$42,\"No\",\"Needs Review\")))","v":""},"Yes","No",0,0]
[null,127,null,null,null,null,null,null,null,null,null,null,null,{"$f":"IF(AND(G138>='A - Contractor Summary'!$C$36,G138<='A - Contractor Summary'!$C$38),\"Yes\",IF(G138<'A - Contractor Summary'!$C$36,\"No\",IF(G138>'A - Contractor Summary'!$C$39,\"\",\"\")))","v":"No"},{"$f":"IF(OR(N138=\"Yes\",N138=\"No\")*AND(G138<'A - Contractor Summary'!$C$39),\"\",IF(AND(G138>'A - Contractor Summary'!$C$39,G138<'A - Contractor Summary'!$C$42),\"Yes\",IF(G138>'A - Contractor Summary'!$C$42,\"No\",\"Needs Review\")))","v":""},"Yes","No",0,0]
[null,128,null,null,null,null,null,null,null,null,null,null,null,{"$f":"IF(AND(G139>='A - Contractor Summary'!$C$36,G139<='A - Contractor Summary'!$C$38),\"Yes\",IF(G139<'A - Contractor Summary'!$C$36,\"No\",IF(G139>'A - Contractor Summary'!$C$39,\"\",\"\")))","v":"No"},{"$f":"IF(OR(N139=\"Yes\",N139=\"No\")*AND(G139<'A - Contractor Summary'!$C$39),\"\",IF(AND(G139>'A - Contractor Summary'!$C$39,G139<'A - Contractor Summary'!$C$42),\"Yes\",IF(G139>'A - Contractor Summary'!$C$42,\"No\",\"Needs Review\")))","v":""},"Yes","No",0,0]
[null,129,null,null,null,null,null,null,null,null,null,null,null,{"$f":"IF(AND(G140>='A - Contractor Summary'!$C$36,G140<='A - Contractor Summary'!$C$38),\"Yes\",IF(G140<'A - Contractor Summary'!$C$36,\"No\",IF(G140>'A - Contractor Summary'!$C$39,\"\",\"\")))","v":"No"},{"$f":"IF(OR(N140=\"Yes\",N140=\"No\")*AND(G140<'A - Contractor Summary'!$C$39),\"\",IF(AND(G140>'A - Contractor Summary'!$C$39,G140<'A - Contractor Summary'!$C$42),\"Yes\",IF(G140>'A - Contractor Summary'!$C$42,\"No\",\"Needs Review\")))","v":""},"Yes",{"$f":"IF(AND(P140=\"Yes\",L140=\"Yes\",M140=\"Yes\")*OR(O140=\"Yes\",N140=\"Yes\"),\"Yes\",IF(OR(L140=\"No\",N140=\"No\",O140=\"No\",P140=\"No\",M140=\"No\"),\"No\",\"Needs Review\"))","v":"No"},{"$f":"IF(Q140=\"Yes\",K140,0)","v":0},{"$f":"IF(Q140=\"Needs Review\",K140,0)","v":0}]
[null,null,null,null,null,null,null,null,null,null,{"$f":"SUM(K14:K140)","v":0},null,null,null,null,null,null,{"$f":"IFERROR(SUM(R14:R140),0)","v":0},{"$f":"IFERROR(SUM(S14:S140),0)","v":0},{"$f":"SUM(T14:T140)","v":0},{"$f":"SUM(U14:U140)","v":0},{"$f":"S141-T141-U141","v":0},"check (a)"]
[]
[]
[]
[null,"Tickmark Explanation:"]
[null,null,1]
[null,null,2]
[null,null,3]
[null,null,4]
[null,null,5]
[null,null,6]
[null,null,7]

{"sheet":"I - Other","index":11,"n_rows":21,"n_cols":23,"rows_kept":21,"cut":false,"hidden":false,"merged":[[12,13,12,21],[12,1,12,12],[3,1,7,12],[21,3,21,21]]}
[]
[null,"Other Charges"]
[]
[null,"Test Plan: (A) Obtain support of individual charges.   (B) Enter Yes/No if receipt is itemized.  (C) Enter Yes/No if proof of payment has been provided.  (D) Ensure charges fall between the dates the vendor was mobilized and the date they arrived.  (E) Ensure charges are prior to the date the vendor arrived home or was released to another utility.  (F) Ensure the expense type is reasonable (G) Determine the amount(s) to be reviewed, allowed and/or disallowed.   (H)  For charges which required further review, document review and include why it was determined to be allowed/disallowed via a tickmark."]
[]
[]
[]
[]
[null,"a","Check figure should equal $0.  Cell will appear yellow if discrepancies are noted."]
[]
[]
[null,null,"A",null,null,null,null,null,null,null,null,"B","C","D","E","F","G",null,null,"H"]
[null,"Support Reviewed",null,null,null,null,null,null,null,null,null,null,null,"Conclusions"]
[null,"#","Type of Support","Support Identifier","Company","Crew","Date","Person","Vendor Name","Location","$ Total","Itemized Receipt","Proof of Payment","Reasonable based on Mobilization date(s)","Reasonable based on Demobilization date(s)","Expense Type Appropriate","Conclusion","$ Allowable Charge","$ To Be Reviewed","Reviewed - Allowable Charge","Reviewed - Unallowable Charge","Tickmarks"]
[null,1,null,null,null,null,null,null,null,null,null,null,null,{"$f":"IF(AND(G15>='A - Contractor Summary'!$C$36,G15<='A - Contractor Summary'!$C$38),\"Yes\",IF(G15<'A - Contractor Summary'!$C$36,\"No\",IF(G15>'A - Contractor Summary'!$C$39,\"\",\"\")))","v":"No"},{"$f":"IF(OR(N15=\"Yes\",N15=\"No\")*AND(G15<'A - Contractor Summary'!$C$39),\"\",IF(AND(G15>'A - Contractor Summary'!$C$39,G15<'A - Contractor Summary'!$C$42),\"Yes\",IF(G15>'A - Contractor Summary'!$C$42,\"No\",\"Needs Review\")))","v":""},"Needs Reviewed",{"$f":"IF(AND(P15=\"YES\",L15=\"Yes\",M15=\"yes\")*OR(N15=\"Yes\",O15=\"Yes\"),\"Yes\",IF(OR(O15=\"No\",P15=\"No\",N15=\"No\",M15=\"No\"),\"No\",\"Needs Review\"))","v":"No"},{"$f":"IF(Q15=\"Yes\",K15,0)","v":0},{"$f":"IF(Q15=\"Needs Review\",K15,0)","v":0},{"$f":"SUM('B - Summary Expenses '!E13:F15)*0.1","v":0},null,1]
[null,null,null,null,null,null,null,null,null,null,{"$f":"SUM(K15:K15)","v":0},null,null,null,null,null,null,{"$f":"IFERROR(SUM(R15:R15),0)","v":0},{"$f":"IFERROR(SUM(S15:S15),0)","v":0},{"$f":"SUM(T15:T15)","v":0},{"$f":"SUM(U15:U15)","v":0},{"$f":"S16-T16-U16","v":0},"check (a)"]
[]
[]
[]
[null,"Tickmark Explanation:"]
[null,null,1]

{"sheet":"G - Per Diem","index":12,"n_rows":44,"n_cols":19,"rows_kept":44,"cut":false,"hidden":false,"merged":[[3,1,8,9],[1,1,1,17],[14,9,14,17],[14,1,14,8],[4,11,6,16]]}
[null,null,null,null,null,null,null," "]
[null,"Per Diem Charges"]
[]
[null,"Test Plan: (A) Enter per diem charges per invoice. (B) Enter number of crew worked per timecard.  (C) Enter the Per Diem Rate charged per person per meal (D) Ensure the number of crew members being charged is appropriate (This is comparing the submitted timecards and the per diem charges invoiced).  (E) Ensure charges fall between the dates the vendor was mobilized and the date they arrived.  (F) Ensure charges are prior to the date the vendor arrived home or was released to another utility.  (G)  Determine the amount(s) to be reviewed, allowed and/or disallowed.   (H) For charges which required further review, document review and include why it was determined to be allowed/disallowed via a tickmark."]
[]
[]
[]
[]
[]
[null,"Rx","Recalculated."]
[null,"a","Check figure should equal $0.  Cell will appear yellow if discrepancies are noted."]
[]
[]
[null,"A",null,null,null,"B","Rx","C","Rx","D","E","F","G",null,null,"H"]
[null,"Support Reviewed",null,null,null,null,null,null,null,"Conclusion"]
[null,"Dates","Company","Per Diem Type","# Crew Worked (per invoice)","# Crew Worked (per timecards)","Difference","Per Diem Rate","Total Per Diem  ","# Crew Reasonable","Reasonable based on Mobilization date(s)","Reasonable based on Demobilization date(s)","Conclusion","$ Allowable Charge","$ To Be Reviewed","Reviewed - Allowable Charge","Reviewed - Unallowable Charge","Tickmarks"]
[null,"10/21/2018-10/27/2018","Vendor No. 01",null,3,null,{"$f":"E17-F17","v":3},172.5,{"$f":"E17*H17","v":517.5},{"$f":"IF(G17>0,\"No\",IF(F17=0,\"N/A\",\"Yes\"))","v":"No"},{"$f":"IF(AND(B17>='A - Contractor Summary'!$C$36,B17<='A - Contractor Summary'!$C$38),\"Yes\",IF(B17<'A - Contractor Summary'!$C$36,\"No\",IF(B17>'A - Contractor Summary'!$C$39,\"\",\"\")))","v":""},{"$f":"IF(OR(K17=\"Yes\",K17=\"No\")*AND(B17<'A - Contractor Summary'!$C$39),\"\",IF(AND(B17>'A - Contractor Summary'!$C$39,B17<'A - Contractor Summary'!$C$42),\"Yes\",IF(B17>'A - Contractor Summary'!$C$42,\"No\",\"Needs Review\")))","v":"No"},{"$f":"IF(AND(J17=\"Yes\")*OR(K17=\"Yes\",L17=\"Yes\"),\"Yes\",IF(OR(K17=\"No\",J17=\"No\",L17=\"No\"),\"No\",\"Needs Review\"))","v":"No"},{"$f":"IF(M17=\"Yes\",I17,0)","v":0},{"$f":"IF(M17=\"Needs Review\",I17,0)","v":0},{"$f":"+I17","v":517.5},null,1]
[null,"10/21/2018-10/27/2018","Vendor No. 01",null,9,null,9,172.5,{"$f":"E18*H18","v":1552.5},{"$f":"IF(G18>0,\"No\",IF(F18=0,\"N/A\",\"Yes\"))","v":"No"},{"$f":"IF(AND(B18>='A - Contractor Summary'!$C$36,B18<='A - Contractor Summary'!$C$38),\"Yes\",IF(B18<'A - Contractor Summary'!$C$36,\"No\",IF(B18>'A - Contractor Summary'!$C$39,\"\",\"\")))","v":""},{"$f":"IF(OR(K18=\"Yes\",K18=\"No\")*AND(B18<'A - Contractor Summary'!$C$39),\"\",IF(AND(B18>'A - Contractor Summary'!$C$39,B18<'A - Contractor Summary'!$C$42),\"Yes\",IF(B18>'A - Contractor Summary'!$C$42,\"No\",\"Needs Review\")))","v":"No"},{"$f":"IF(AND(J18=\"Yes\")*OR(K18=\"Yes\",L18=\"Yes\"),\"Yes\",IF(OR(K18=\"No\",J18=\"No\",L18=\"No\"),\"No\",\"Needs Review\"))","v":"No"},{"$f":"IF(M18=\"Yes\",I18,0)","v":0},{"$f":"IF(M18=\"Needs Review\",I18,0)","v":0},{"$f":"+I18","v":1552.5},null,1]
[null,"10/21/2018-10/27/2018","Vendor No. 01",null,9,null,9,172.5,1552.5,{"$f":"IF(G19>0,\"No\",IF(F19=0,\"N/A\",\"Yes\"))","v":"No"},{"$f":"IF(AND(B19>='A - Contractor Summary'!$C$36,B19<='A - Contractor Summary'!$C$38),\"Yes\",IF(B19<'A - Contractor Summary'!$C$36,\"No\",IF(B19>'A - Contractor Summary'!$C$39,\"\",\"\")))","v":""},{"$f":"IF(OR(K19=\"Yes\",K19=\"No\")*AND(B19<'A - Contractor Summary'!$C$39),\"\",IF(AND(B19>'A - Contractor Summary'!$C$39,B19<'A - Contractor Summary'!$C$42),\"Yes\",IF(B19>'A - Contractor Summary'!$C$42,\"No\",\"Needs Review\")))","v":"No"},"No",{"$f":"IF(M19=\"Yes\",I19,0)","v":0},0,1552.5,null,1]
[null,"10/21/2018-10/27/2018","Vendor No. 01",null,6,null,6,172.5,1035,"No",{"$f":"IF(AND(B20>='A - Contractor Summary'!$C$36,B20<='A - Contractor Summary'!$C$38),\"Yes\",IF(B20<'A - Contractor Summary'!$C$36,\"No\",IF(B20>'A - Contractor Summary'!$C$39,\"\",\"\")))","v":""},{"$f":"IF(OR(K20=\"Yes\",K20=\"No\")*AND(B20<'A - Contractor Summary'!$C$39),\"\",IF(AND(B20>'A - Contractor Summary'!$C$39,B20<'A - Contractor Summary'!$C$42),\"Yes\",IF(B20>'A - Contractor Summary'!$C$42,\"No\",\"Needs Review\")))","v":"No"},"No",0,0,1035,null,1]
[null,null,null,null,null,null,null,null,null,null,null,null,null,null,null,0,null,1]
[null,"10/21/2018-10/27/2018","Vendor No. 01",null,2,null,2,172.5,345,"No",{"$f":"IF(AND(B22>='A - Contractor Summary'!$C$36,B22<='A - Contractor Summary'!$C$38),\"Yes\",IF(B22<'A - Contractor Summary'!$C$36,\"No\",IF(B22>'A - Contractor Summary'!$C$39,\"\",\"\")))","v":""},{"$f":"IF(OR(K22=\"Yes\",K22=\"No\")*AND(B22<'A - Contractor Summary'!$C$39),\"\",IF(AND(B22>'A - Contractor Summary'!$C$39,B22<'A - Contractor Summary'!$C$42),\"Yes\",IF(B22>'A - Contractor Summary'!$C$42,\"No\",\"Needs Review\")))","v":"No"},"No",0,0,345,null,1]
[null,"10/21/2018-10/27/2018","Vendor No. 01",null,3,null,3,172.5,517.5,"No",{"$f":"IF(AND(B23>='A - Contractor Summary'!$C$36,B23<='A - Contractor Summary'!$C$38),\"Yes\",IF(B23<'A - Contractor Summary'!$C$36,\"No\",IF(B23>'A - Contractor Summary'!$C$39,\"\",\"\")))","v":""},{"$f":"IF(OR(K23=\"Yes\",K23=\"No\")*AND(B23<'A - Contractor Summary'!$C$39),\"\",IF(AND(B23>'A - Contractor Summary'!$C$39,B23<'A - Contractor Summary'!$C$42),\"Yes\",IF(B23>'A - Contractor Summary'!$C$42,\"No\",\"Needs Review\")))","v":"No"},"No",0,0,517.5,null,1]
[null,"10/21/2018-10/27/2018","Vendor No. 01",null,3,null,3,172.5,517.5,"No",{"$f":"IF(AND(B24>='A - Contractor Summary'!$C$36,B24<='A - Contractor Summary'!$C$38),\"Yes\",IF(B24<'A - Contractor Summary'!$C$36,\"No\",IF(B24>'A - Contractor Summary'!$C$39,\"\",\"\")))","v":""},{"$f":"IF(OR(K24=\"Yes\",K24=\"No\")*AND(B24<'A - Contractor Summary'!$C$39),\"\",IF(AND(B24>'A - Contractor Summary'!$C$39,B24<'A - Contractor Summary'!$C$42),\"Yes\",IF(B24>'A - Contractor Summary'!$C$42,\"No\",\"Needs Review\")))","v":"No"},"No",0,0,517.5,null,1]
[null,"10/21/2018-10/27/2018","Vendor No. 01",null,3,null,3,172.5,517.5,"No",{"$f":"IF(AND(B25>='A - Contractor Summary'!$C$36,B25<='A - Contractor Summary'!$C$38),\"Yes\",IF(B25<'A - Contractor Summary'!$C$36,\"No\",IF(B25>'A - Contractor Summary'!$C$39,\"\",\"\")))","v":""},{"$f":"IF(OR(K25=\"Yes\",K25=\"No\")*AND(B25<'A - Contractor Summary'!$C$39),\"\",IF(AND(B25>'A - Contractor Summary'!$C$39,B25<'A - Contractor Summary'!$C$42),\"Yes\",IF(B25>'A - Contractor Summary'!$C$42,\"No\",\"Needs Review\")))","v":"No"},"No",0,0,517.5,null,1]
[null,null,null,null,null,null,null,null,null,null,null,null,null,null,null,0,null,1]
[null,"10/28/2018-11/3/2018","Vendor No. 01",null,3,null,3,33.33,99.99,"No",{"$f":"IF(AND(B27>='A - Contractor Summary'!$C$36,B27<='A - Contractor Summary'!$C$38),\"Yes\",IF(B27<'A - Contractor Summary'!$C$36,\"No\",IF(B27>'A - Contractor Summary'!$C$39,\"\",\"\")))","v":""},{"$f":"IF(OR(K27=\"Yes\",K27=\"No\")*AND(B27<'A - Contractor Summary'!$C$39),\"\",IF(AND(B27>'A - Contractor Summary'!$C$39,B27<'A - Contractor Summary'!$C$42),\"Yes\",IF(B27>'A - Contractor Summary'!$C$42,\"No\",\"Needs Review\")))","v":"No"},"No",0,0,99.99,null,1]
[null,"10/28/2018-11/3/2018","Vendor No. 01",null,9,null,9,33.33,299.96999999999997,"No",{"$f":"IF(AND(B28>='A - Contractor Summary'!$C$36,B28<='A - Contractor Summary'!$C$38),\"Yes\",IF(B28<'A - Contractor Summary'!$C$36,\"No\",IF(B28>'A - Contractor Summary'!$C$39,\"\",\"\")))","v":""},{"$f":"IF(OR(K28=\"Yes\",K28=\"No\")*AND(B28<'A - Contractor Summary'!$C$39),\"\",IF(AND(B28>'A - Contractor Summary'!$C$39,B28<'A - Contractor Summary'!$C$42),\"Yes\",IF(B28>'A - Contractor Summary'!$C$42,\"No\",\"Needs Review\")))","v":"No"},"No",0,0,299.96999999999997,null,1]
[null,"10/28/2018-11/3/2018","Vendor No. 01",null,9,null,9,33.33,299.96999999999997,"No",{"$f":"IF(AND(B29>='A - Contractor Summary'!$C$36,B29<='A - Contractor Summary'!$C$38),\"Yes\",IF(B29<'A - Contractor Summary'!$C$36,\"No\",IF(B29>'A - Contractor Summary'!$C$39,\"\",\"\")))","v":""},{"$f":"IF(OR(K29=\"Yes\",K29=\"No\")*AND(B29<'A - Contractor Summary'!$C$39),\"\",IF(AND(B29>'A - Contractor Summary'!$C$39,B29<'A - Contractor Summary'!$C$42),\"Yes\",IF(B29>'A - Contractor Summary'!$C$42,\"No\",\"Needs Review\")))","v":"No"},"No",0,0,299.96999999999997,null,1]
[null,"10/28/2018-11/3/2018","Vendor No. 01",null,9,null,9,33.33,299.96999999999997,"No",{"$f":"IF(AND(B30>='A - Contractor Summary'!$C$36,B30<='A - Contractor Summary'!$C$38),\"Yes\",IF(B30<'A - Contractor Summary'!$C$36,\"No\",IF(B30>'A - Contractor Summary'!$C$39,\"\",\"\")))","v":""},{"$f":"IF(OR(K30=\"Yes\",K30=\"No\")*AND(B30<'A - Contractor Summary'!$C$39),\"\",IF(AND(B30>'A - Contractor Summary'!$C$39,B30<'A - Contractor Summary'!$C$42),\"Yes\",IF(B30>'A - Contractor Summary'!$C$42,\"No\",\"Needs Review\")))","v":"No"},"No",0,0,299.96999999999997,null,1]
[null,null,null,null,null,null,null,null,null,null,null,null,null,null,null,0,null,1]
[null,"10/28/2018-11/3/2018","Vendor No. 01",null,4,null,4,172.5,690,"No",{"$f":"IF(AND(B32>='A - Contractor Summary'!$C$36,B32<='A - Contractor Summary'!$C$38),\"Yes\",IF(B32<'A - Contractor Summary'!$C$36,\"No\",IF(B32>'A - Contractor Summary'!$C$39,\"\",\"\")))","v":""},{"$f":"IF(OR(K32=\"Yes\",K32=\"No\")*AND(B32<'A - Contractor Summary'!$C$39),\"\",IF(AND(B32>'A - Contractor Summary'!$C$39,B32<'A - Contractor Summary'!$C$42),\"Yes\",IF(B32>'A - Contractor Summary'!$C$42,\"No\",\"Needs Review\")))","v":"No"},"No",0,0,690,null,1]
[null,"10/28/2018-11/3/2018","Vendor No. 01",null,3,null,3,172.5,517.5,"No",{"$f":"IF(AND(B33>='A - Contractor Summary'!$C$36,B33<='A - Contractor Summary'!$C$38),\"Yes\",IF(B33<'A - Contractor Summary'!$C$36,\"No\",IF(B33>'A - Contractor Summary'!$C$39,\"\",\"\")))","v":""},{"$f":"IF(OR(K33=\"Yes\",K33=\"No\")*AND(B33<'A - Contractor Summary'!$C$39),\"\",IF(AND(B33>'A - Contractor Summary'!$C$39,B33<'A - Contractor Summary'!$C$42),\"Yes\",IF(B33>'A - Contractor Summary'!$C$42,\"No\",\"Needs Review\")))","v":"No"},"No",0,0,517.5,null,1]
[null,"10/28/2018-11/3/2018","Vendor No. 01",null,3,null,3,172.5,517.5,"No",{"$f":"IF(AND(B34>='A - Contractor Summary'!$C$36,B34<='A - Contractor Summary'!$C$38),\"Yes\",IF(B34<'A - Contractor Summary'!$C$36,\"No\",IF(B34>'A - Contractor Summary'!$C$39,\"\",\"\")))","v":""},{"$f":"IF(OR(K34=\"Yes\",K34=\"No\")*AND(B34<'A - Contractor Summary'!$C$39),\"\",IF(AND(B34>'A - Contractor Summary'!$C$39,B34<'A - Contractor Summary'!$C$42),\"Yes\",IF(B34>'A - Contractor Summary'!$C$42,\"No\",\"Needs Review\")))","v":"No"},"No",0,0,517.5,null,1]
[null,"10/28/2018-11/3/2018","Vendor No. 01",null,3,null,3,172.5,517.5,"No",{"$f":"IF(AND(B35>='A - Contractor Summary'!$C$36,B35<='A - Contractor Summary'!$C$38),\"Yes\",IF(B35<'A - Contractor Summary'!$C$36,\"No\",IF(B35>'A - Contractor Summary'!$C$39,\"\",\"\")))","v":""},{"$f":"IF(OR(K35=\"Yes\",K35=\"No\")*AND(B35<'A - Contractor Summary'!$C$39),\"\",IF(AND(B35>'A - Contractor Summary'!$C$39,B35<'A - Contractor Summary'!$C$42),\"Yes\",IF(B35>'A - Contractor Summary'!$C$42,\"No\",\"Needs Review\")))","v":"No"},"No",0,0,517.5,null,1]
[null,null,null,null,null,null,0,null,0,"N/A",{"$f":"IF(AND(B36>='A - Contractor Summary'!$C$36,B36<='A - Contractor Summary'!$C$38),\"Yes\",IF(B36<'A - Contractor Summary'!$C$36,\"No\",IF(B36>'A - Contractor Summary'!$C$39,\"\",\"\")))","v":"No"},{"$f":"IF(OR(K36=\"Yes\",K36=\"No\")*AND(B36<'A - Contractor Summary'!$C$39),\"\",IF(AND(B36>'A - Contractor Summary'!$C$39,B36<'A - Contractor Summary'!$C$42),\"Yes\",IF(B36>'A - Contractor Summary'!$C$42,\"No\",\"Needs Review\")))","v":""},"No",0,0,0]
[null,null,null,null,null,null,0,null,0,"N/A",{"$f":"IF(AND(B37>='A - Contractor Summary'!$C$36,B37<='A - Contractor Summary'!$C$38),\"Yes\",IF(B37<'A - Contractor Summary'!$C$36,\"No\",IF(B37>'A - Contractor Summary'!$C$39,\"\",\"\")))","v":"No"},{"$f":"IF(OR(K37=\"Yes\",K37=\"No\")*AND(B37<'A - Contractor Summary'!$C$39),\"\",IF(AND(B37>'A - Contractor Summary'!$C$39,B37<'A - Contractor Summary'!$C$42),\"Yes\",IF(B37>'A - Contractor Summary'!$C$42,\"No\",\"Needs Review\")))","v":""},"No",0,0,0]
[null,null,null,null,null,null,0,null,0,"N/A",{"$f":"IF(AND(B38>='A - Contractor Summary'!$C$36,B38<='A - Contractor Summary'!$C$38),\"Yes\",IF(B38<'A - Contractor Summary'!$C$36,\"No\",IF(B38>'A - Contractor Summary'!$C$39,\"\",\"\")))","v":"No"},{"$f":"IF(OR(K38=\"Yes\",K38=\"No\")*AND(B38<'A - Contractor Summary'!$C$39),\"\",IF(AND(B38>'A - Contractor Summary'!$C$39,B38<'A - Contractor Summary'!$C$42),\"Yes\",IF(B38>'A - Contractor Summary'!$C$42,\"No\",\"Needs Review\")))","v":""},"No",0,0]
[null,null,null,null,null,null,{"$f":"SUM(G17:G38)","v":81},null,{"$f":"SUM(I17:I38)","v":9797.4000000000015},null,null,null,null,{"$f":"IFERROR(SUM(N17:N38),0)","v":0},{"$f":"IFERROR(SUM(O17:O38),0)","v":0},{"$f":"SUM(P17:P38)","v":9797.4000000000015},{"$f":"SUM(Q17:Q38)","v":0},{"$f":"O39-P39-Q39","v":-9797.4000000000015},"check (a)"]
[]
[]
[null,"Tickmark Explanation:"]
[]
[null,"1 Documentation Provided"]

{"sheet":"H - Mileage","index":13,"n_rows":42,"n_cols":23,"rows_kept":42,"cut":false,"hidden":false,"merged":[[1,1,1,21],[13,1,13,11],[13,12,13,21],[3,1,7,11],[5,14,7,19]]}
[]
[null,"Mileage Charges"]
[]
[null,"Test Plan: (A) Obtain support of individual mileage charged (Typically a rate and mileage included on invoice).  (B) Ensure charges fall between the dates the vendor was mobilized and the date they arrived.  (C) Ensure charges are prior to the date the vendor arrived home or was released to another utility.  (D)  Ensure number of miles charged deemed reasonable based on vendor location (recalculated per 'A - Contractor Summary' tab).  (E) Ensure the location of charge was reasonable (If mobilizing, charges should be related to travelling to TECO Service area, and home, if demobilizing).  (F) Determine the amount(s) to be reviewed, allowed and/or disallowed.  (G) For charges which required further review, document review and include why it was determined to be allowed/disallowed via a tickmark."]
[]
[]
[]
[]
[]
[null,"Rx","Recalculated."]
[null,"a","Check figure should equal $0.  Cell will appear yellow if discrepancies are noted."]
[]
[null,null,"A",null,null,null,null,null,null,null,null,"Rx","B","C","D","E","F",null,null,"G"]
[null,"Support Reviewed",null,null,null,null,null,null,null,null,null,null,"Conclusions"]
[null,"#","Type of Support","Company","Equipment Name","Equipment ID","Crew","Date","Location","Miles Charged","$ / Mile (Rate)","Total Charge","Reasonable based on Mobilization date(s)","Reasonable based on Demobilization date(s)","Number of Miles Charged Reasonable","Locations Reasonable","Conclusion","$ Allowable Charge","$ To Be Reviewed","Reviewed - Allowable Charge","Reviewed - Unallowable Charge","Tickmarks"]
[null,1,null,null,null,null,null,null,null,null,null,{"$f":"J16*K16","v":0},{"$f":"IF(AND(H16>='A - Contractor Summary'!$C$36,H16<='A - Contractor Summary'!$C$38),\"Yes\",IF(H16<'A - Contractor Summary'!$C$36,\"No\",IF(H16>'A - Contractor Summary'!$C$39,\"\",\"\")))","v":"No"},{"$f":"IF(OR(M16=\"Yes\",M16=\"No\")*AND(H16<'A - Contractor Summary'!$C$39),\"\",IF(AND(H16>'A - Contractor Summary'!$C$39,H16<'A - Contractor Summary'!$C$42),\"Yes\",IF(H16>'A - Contractor Summary'!$C$42,\"No\",\"Needs Review\")))","v":""},{"$f":"IF(AND(J16>PRODUCT('A - Contractor Summary'!$C$29,0.85),J16<PRODUCT('A - Contractor Summary'!$C$29,1.15)),\"Yes\",\"No\")","v":"No"},null,{"$f":"IF(AND(P16=\"Yes\",O16=\"Yes\")*OR(N16=\"Yes\",M16=\"Yes\"),\"Yes\",IF(OR(M16=\"No\",N16=\"No\",P16=\"No\",O16=\"No\"),\"No\",\"Needs Review\"))","v":"No"},{"$f":"IF(Q16=\"Yes\",L16,0)","v":0},{"$f":"IF(Q16=\"Needs Review\",L16,0)","v":0}]
[null,2,null,null,null,null,null,null,null,null,null,0,{"$f":"IF(AND(H17>='A - Contractor Summary'!$C$36,H17<='A - Contractor Summary'!$C$38),\"Yes\",IF(H17<'A - Contractor Summary'!$C$36,\"No\",IF(H17>'A - Contractor Summary'!$C$39,\"\",\"\")))","v":"No"},{"$f":"IF(OR(M17=\"Yes\",M17=\"No\")*AND(H17<'A - Contractor Summary'!$C$39),\"\",IF(AND(H17>'A - Contractor Summary'!$C$39,H17<'A - Contractor Summary'!$C$42),\"Yes\",IF(H17>'A - Contractor Summary'!$C$42,\"No\",\"Needs Review\")))","v":""},{"$f":"IF(AND(J17>PRODUCT('A - Contractor Summary'!$C$29,0.85),J17<PRODUCT('A - Contractor Summary'!$C$29,1.15)),\"Yes\",\"No\")","v":"No"},null,"No",0,0]
[null,3,null,null,null,null,null,null,null,null,null,0,{"$f":"IF(AND(H18>='A - Contractor Summary'!$C$36,H18<='A - Contractor Summary'!$C$38),\"Yes\",IF(H18<'A - Contractor Summary'!$C$36,\"No\",IF(H18>'A - Contractor Summary'!$C$39,\"\",\"\")))","v":"No"},{"$f":"IF(OR(M18=\"Yes\",M18=\"No\")*AND(H18<'A - Contractor Summary'!$C$39),\"\",IF(AND(H18>'A - Contractor Summary'!$C$39,H18<'A - Contractor Summary'!$C$42),\"Yes\",IF(H18>'A - Contractor Summary'!$C$42,\"No\",\"Needs Review\")))","v":""},{"$f":"IF(AND(J18>PRODUCT('A - Contractor Summary'!$C$29,0.85),J18<PRODUCT('A - Contractor Summary'!$C$29,1.15)),\"Yes\",\"No\")","v":"No"},null,"No",0,0]
[null,4,null,null,null,null,null,null,null,null,null,0,{"$f":"IF(AND(H19>='A - Contractor Summary'!$C$36,H19<='A - Contractor Summary'!$C$38),\"Yes\",IF(H19<'A - Contractor Summary'!$C$36,\"No\",IF(H19>'A - Contractor Summary'!$C$39,\"\",\"\")))","v":"No"},{"$f":"IF(OR(M19=\"Yes\",M19=\"No\")*AND(H19<'A - Contractor Summary'!$C$39),\"\",IF(AND(H19>'A - Contractor Summary'!$C$39,H19<'A - Contractor Summary'!$C$42),\"Yes\",IF(H19>'A - Contractor Summary'!$C$42,\"No\",\"Needs Review\")))","v":""},{"$f":"IF(AND(J19>PRODUCT('A - Contractor Summary'!$C$29,0.85),J19<PRODUCT('A - Contractor Summary'!$C$29,1.15)),\"Yes\",\"No\")","v":"No"},null,"No",0,0]
[null,5,null,null,null,null,null,null,null,null,null,0,{"$f":"IF(AND(H20>='A - Contractor Summary'!$C$36,H20<='A - Contractor Summary'!$C$38),\"Yes\",IF(H20<'A - Contractor Summary'!$C$36,\"No\",IF(H20>'A - Contractor Summary'!$C$39,\"\",\"\")))","v":"No"},{"$f":"IF(OR(M20=\"Yes\",M20=\"No\")*AND(H20<'A - Contractor Summary'!$C$39),\"\",IF(AND(H20>'A - Contractor Summary'!$C$39,H20<'A - Contractor Summary'!$C$42),\"Yes\",IF(H20>'A - Contractor Summary'!$C$42,\"No\",\"Needs Review\")))","v":""},{"$f":"IF(AND(J20>PRODUCT('A - Contractor Summary'!$C$29,0.85),J20<PRODUCT('A - Contractor Summary'!$C$29,1.15)),\"Yes\",\"No\")","v":"No"},null,"No",0,0]
[null,6,null,null,null,null,null,null,null,null,null,0,{"$f":"IF(AND(H21>='A - Contractor Summary'!$C$36,H21<='A - Contractor Summary'!$C$38),\"Yes\",IF(H21<'A - Contractor Summary'!$C$36,\"No\",IF(H21>'A - Contractor Summary'!$C$39,\"\",\"\")))","v":"No"},{"$f":"IF(OR(M21=\"Yes\",M21=\"No\")*AND(H21<'A - Contractor Summary'!$C$39),\"\",IF(AND(H21>'A - Contractor Summary'!$C$39,H21<'A - Contractor Summary'!$C$42),\"Yes\",IF(H21>'A - Contractor Summary'!$C$42,\"No\",\"Needs Review\")))","v":""},{"$f":"IF(AND(J21>PRODUCT('A - Contractor Summary'!$C$29,0.85),J21<PRODUCT('A - Contractor Summary'!$C$29,1.15)),\"Yes\",\"No\")","v":"No"},null,"No",0,0]
[null,7,null,null,null,null,null,null,null,null,null,0,{"$f":"IF(AND(H22>='A - Contractor Summary'!$C$36,H22<='A - Contractor Summary'!$C$38),\"Yes\",IF(H22<'A - Contractor Summary'!$C$36,\"No\",IF(H22>'A - Contractor Summary'!$C$39,\"\",\"\")))","v":"No"},{"$f":"IF(OR(M22=\"Yes\",M22=\"No\")*AND(H22<'A - Contractor Summary'!$C$39),\"\",IF(AND(H22>'A - Contractor Summary'!$C$39,H22<'A - Contractor Summary'!$C$42),\"Yes\",IF(H22>'A - Contractor Summary'!$C$42,\"No\",\"Needs Review\")))","v":""},{"$f":"IF(AND(J22>PRODUCT('A - Contractor Summary'!$C$29,0.85),J22<PRODUCT('A - Contractor Summary'!$C$29,1.15)),\"Yes\",\"No\")","v":"No"},null,"No",0,0]
[null,8,null,null,null,null,null,null,null,null,null,0,{"$f":"IF(AND(H23>='A - Contractor Summary'!$C$36,H23<='A - Contractor Summary'!$C$38),\"Yes\",IF(H23<'A - Contractor Summary'!$C$36,\"No\",IF(H23>'A - Contractor Summary'!$C$39,\"\",\"\")))","v":"No"},{"$f":"IF(OR(M23=\"Yes\",M23=\"No\")*AND(H23<'A - Contractor Summary'!$C$39),\"\",IF(AND(H23>'A - Contractor Summary'!$C$39,H23<'A - Contractor Summary'!$C$42),\"Yes\",IF(H23>'A - Contractor Summary'!$C$42,\"No\",\"Needs Review\")))","v":""},{"$f":"IF(AND(J23>PRODUCT('A - Contractor Summary'!$C$29,0.85),J23<PRODUCT('A - Contractor Summary'!$C$29,1.15)),\"Yes\",\"No\")","v":"No"},null,"No",0,0]
[null,9,null,null,null,null,null,null,null,null,null,0,{"$f":"IF(AND(H24>='A - Contractor Summary'!$C$36,H24<='A - Contractor Summary'!$C$38),\"Yes\",IF(H24<'A - Contractor Summary'!$C$36,\"No\",IF(H24>'A - Contractor Summary'!$C$39,\"\",\"\")))","v":"No"},{"$f":"IF(OR(M24=\"Yes\",M24=\"No\")*AND(H24<'A - Contractor Summary'!$C$39),\"\",IF(AND(H24>'A - Contractor Summary'!$C$39,H24<'A - Contractor Summary'!$C$42),\"Yes\",IF(H24>'A - Contractor Summary'!$C$42,\"No\",\"Needs Review\")))","v":""},{"$f":"IF(AND(J24>PRODUCT('A - Contractor Summary'!$C$29,0.85),J24<PRODUCT('A - Contractor Summary'!$C$29,1.15)),\"Yes\",\"No\")","v":"No"},null,"No",0,0]
[null,10,null,null,null,null,null,null,null,null,null,0,{"$f":"IF(AND(H25>='A - Contractor Summary'!$C$36,H25<='A - Contractor Summary'!$C$38),\"Yes\",IF(H25<'A - Contractor Summary'!$C$36,\"No\",IF(H25>'A - Contractor Summary'!$C$39,\"\",\"\")))","v":"No"},{"$f":"IF(OR(M25=\"Yes\",M25=\"No\")*AND(H25<'A - Contractor Summary'!$C$39),\"\",IF(AND(H25>'A - Contractor Summary'!$C$39,H25<'A - Contractor Summary'!$C$42),\"Yes\",IF(H25>'A - Contractor Summary'!$C$42,\"No\",\"Needs Review\")))","v":""},{"$f":"IF(AND(J25>PRODUCT('A - Contractor Summary'!$C$29,0.85),J25<PRODUCT('A - Contractor Summary'!$C$29,1.15)),\"Yes\",\"No\")","v":"No"},null,"No",0,0]
[null,11,null,null,null,null,null,null,null,null,null,0,{"$f":"IF(AND(H26>='A - Contractor Summary'!$C$36,H26<='A - Contractor Summary'!$C$38),\"Yes\",IF(H26<'A - Contractor Summary'!$C$36,\"No\",IF(H26>'A - Contractor Summary'!$C$39,\"\",\"\")))","v":"No"},{"$f":"IF(OR(M26=\"Yes\",M26=\"No\")*AND(H26<'A - Contractor Summary'!$C$39),\"\",IF(AND(H26>'A - Contractor Summary'!$C$39,H26<'A - Contractor Summary'!$C$42),\"Yes\",IF(H26>'A - Contractor Summary'!$C$42,\"No\",\"Needs Review\")))","v":""},{"$f":"IF(AND(J26>PRODUCT('A - Contractor Summary'!$C$29,0.85),J26<PRODUCT('A - Contractor Summary'!$C$29,1.15)),\"Yes\",\"No\")","v":"No"},null,"No",0,0]
[null,12,null,null,null,null,null,null,null,null,null,0,{"$f":"IF(AND(H27>='A - Contractor Summary'!$C$36,H27<='A - Contractor Summary'!$C$38),\"Yes\",IF(H27<'A - Contractor Summary'!$C$36,\"No\",IF(H27>'A - Contractor Summary'!$C$39,\"\",\"\")))","v":"No"},{"$f":"IF(OR(M27=\"Yes\",M27=\"No\")*AND(H27<'A - Contractor Summary'!$C$39),\"\",IF(AND(H27>'A - Contractor Summary'!$C$39,H27<'A - Contractor Summary'!$C$42),\"Yes\",IF(H27>'A - Contractor Summary'!$C$42,\"No\",\"Needs Review\")))","v":""},{"$f":"IF(AND(J27>PRODUCT('A - Contractor Summary'!$C$29,0.85),J27<PRODUCT('A - Contractor Summary'!$C$29,1.15)),\"Yes\",\"No\")","v":"No"},null,"No",0,0]
[null,13,null,null,null,null,null,null,null,null,null,0,{"$f":"IF(AND(H28>='A - Contractor Summary'!$C$36,H28<='A - Contractor Summary'!$C$38),\"Yes\",IF(H28<'A - Contractor Summary'!$C$36,\"No\",IF(H28>'A - Contractor Summary'!$C$39,\"\",\"\")))","v":"No"},{"$f":"IF(OR(M28=\"Yes\",M28=\"No\")*AND(H28<'A - Contractor Summary'!$C$39),\"\",IF(AND(H28>'A - Contractor Summary'!$C$39,H28<'A - Contractor Summary'!$C$42),\"Yes\",IF(H28>'A - Contractor Summary'!$C$42,\"No\",\"Needs Review\")))","v":""},{"$f":"IF(AND(J28>PRODUCT('A - Contractor Summary'!$C$29,0.85),J28<PRODUCT('A - Contractor Summary'!$C$29,1.15)),\"Yes\",\"No\")","v":"No"},null,"No",0,0]
[null,14,null,null,null,null,null,null,null,null,null,0,{"$f":"IF(AND(H29>='A - Contractor Summary'!$C$36,H29<='A - Contractor Summary'!$C$38),\"Yes\",IF(H29<'A - Contractor Summary'!$C$36,\"No\",IF(H29>'A - Contractor Summary'!$C$39,\"\",\"\")))","v":"No"},{"$f":"IF(OR(M29=\"Yes\",M29=\"No\")*AND(H29<'A - Contractor Summary'!$C$39),\"\",IF(AND(H29>'A - Contractor Summary'!$C$39,H29<'A - Contractor Summary'!$C$42),\"Yes\",IF(H29>'A - Contractor Summary'!$C$42,\"No\",\"Needs Review\")))","v":""},{"$f":"IF(AND(J29>PRODUCT('A - Contractor Summary'!$C$29,0.85),J29<PRODUCT('A - Contractor Summary'!$C$29,1.15)),\"Yes\",\"No\")","v":"No"},null,"No",0,0]
[null,15,null,null,null,null,null,null,null,null,null,0,{"$f":"IF(AND(H30>='A - Contractor Summary'!$C$36,H30<='A - Contractor Summary'!$C$38),\"Yes\",IF(H30<'A - Contractor Summary'!$C$36,\"No\",IF(H30>'A - Contractor Summary'!$C$39,\"\",\"\")))","v":"No"},{"$f":"IF(OR(M30=\"Yes\",M30=\"No\")*AND(H30<'A - Contractor Summary'!$C$39),\"\",IF(AND(H30>'A - Contractor Summary'!$C$39,H30<'A - Contractor Summary'!$C$42),\"Yes\",IF(H30>'A - Contractor Summary'!$C$42,\"No\",\"Needs Review\")))","v":""},{"$f":"IF(AND(J30>PRODUCT('A - Contractor Summary'!$C$29,0.85),J30<PRODUCT('A - Contractor Summary'!$C$29,1.15)),\"Yes\",\"No\")","v":"No"},null,"No",0,0]
[null,16,null,null,null,null,null,null,null,null,null,0,{"$f":"IF(AND(H31>='A - Contractor Summary'!$C$36,H31<='A - Contractor Summary'!$C$38),\"Yes\",IF(H31<'A - Contractor Summary'!$C$36,\"No\",IF(H31>'A - Contractor Summary'!$C$39,\"\",\"\")))","v":"No"},{"$f":"IF(OR(M31=\"Yes\",M31=\"No\")*AND(H31<'A - Contractor Summary'!$C$39),\"\",IF(AND(H31>'A - Contractor Summary'!$C$39,H31<'A - Contractor Summary'!$C$42),\"Yes\",IF(H31>'A - Contractor Summary'!$C$42,\"No\",\"Needs Review\")))","v":""},{"$f":"IF(AND(J31>PRODUCT('A - Contractor Summary'!$C$29,0.85),J31<PRODUCT('A - Contractor Summary'!$C$29,1.15)),\"Yes\",\"No\")","v":"No"},null,"No",0,0]
[null,17,null,null,null,null,null,null,null,null,null,0,{"$f":"IF(AND(H32>='A - Contractor Summary'!$C$36,H32<='A - Contractor Summary'!$C$38),\"Yes\",IF(H32<'A - Contractor Summary'!$C$36,\"No\",IF(H32>'A - Contractor Summary'!$C$39,\"\",\"\")))","v":"No"},{"$f":"IF(OR(M32=\"Yes\",M32=\"No\")*AND(H32<'A - Contractor Summary'!$C$39),\"\",IF(AND(H32>'A - Contractor Summary'!$C$39,H32<'A - Contractor Summary'!$C$42),\"Yes\",IF(H32>'A - Contractor Summary'!$C$42,\"No\",\"Needs Review\")))","v":""},{"$f":"IF(AND(J32>PRODUCT('A - Contractor Summary'!$C$29,0.85),J32<PRODUCT('A - Contractor Summary'!$C$29,1.15)),\"Yes\",\"No\")","v":"No"},null,"No",0,0]
[null,18,null,null,null,null,null,null,null,null,null,0,{"$f":"IF(AND(H33>='A - Contractor Summary'!$C$36,H33<='A - Contractor Summary'!$C$38),\"Yes\",IF(H33<'A - Contractor Summary'!$C$36,\"No\",IF(H33>'A - Contractor Summary'!$C$39,\"\",\"\")))","v":"No"},{"$f":"IF(OR(M33=\"Yes\",M33=\"No\")*AND(H33<'A - Contractor Summary'!$C$39),\"\",IF(AND(H33>'A - Contractor Summary'!$C$39,H33<'A - Contractor Summary'!$C$42),\"Yes\",IF(H33>'A - Contractor Summary'!$C$42,\"No\",\"Needs Review\")))","v":""},{"$f":"IF(AND(J33>PRODUCT('A - Contractor Summary'!$C$29,0.85),J33<PRODUCT('A - Contractor Summary'!$C$29,1.15)),\"Yes\",\"No\")","v":"No"},null,"No",{"$f":"IF(Q33=\"Yes\",#REF!,0)","v":0},0]
[null,19,null,null,null,null,null,null,null,null,null,0,{"$f":"IF(AND(H34>='A - Contractor Summary'!$C$36,H34<='A - Contractor Summary'!$C$38),\"Yes\",IF(H34<'A - Contractor Summary'!$C$36,\"No\",IF(H34>'A - Contractor Summary'!$C$39,\"\",\"\")))","v":"No"},{"$f":"IF(OR(M34=\"Yes\",M34=\"No\")*AND(H34<'A - Contractor Summary'!$C$39),\"\",IF(AND(H34>'A - Contractor Summary'!$C$39,H34<'A - Contractor Summary'!$C$42),\"Yes\",IF(H34>'A - Contractor Summary'!$C$42,\"No\",\"Needs Review\")))","v":""},{"$f":"IF(AND(J34>PRODUCT('A - Contractor Summary'!$C$29,0.85),J34<PRODUCT('A - Contractor Summary'!$C$29,1.15)),\"Yes\",\"No\")","v":"No"},null,"No",{"$f":"IF(Q34=\"Yes\",#REF!,0)","v":0},0]
[null,20,null,null,null,null,null,null,null,null,null,0,{"$f":"IF(AND(H35>='A - Contractor Summary'!$C$36,H35<='A - Contractor Summary'!$C$38),\"Yes\",IF(H35<'A - Contractor Summary'!$C$36,\"No\",IF(H35>'A - Contractor Summary'!$C$39,\"\",\"\")))","v":"No"},{"$f":"IF(OR(M35=\"Yes\",M35=\"No\")*AND(H35<'A - Contractor Summary'!$C$39),\"\",IF(AND(H35>'A - Contractor Summary'!$C$39,H35<'A - Contractor Summary'!$C$42),\"Yes\",IF(H35>'A - Contractor Summary'!$C$42,\"No\",\"Needs Review\")))","v":""},{"$f":"IF(AND(J35>PRODUCT('A - Contractor Summary'!$C$29,0.85),J35<PRODUCT('A - Contractor Summary'!$C$29,1.15)),\"Yes\",\"No\")","v":"No"},null,"No",{"$f":"IF(Q35=\"Yes\",#REF!,0)","v":0},{"$f":"IF(Q35=\"ED Review\",#REF!,0)","v":0}]
[null,null,null,null,null,null,null,null,null,null,null,{"$f":"SUM(L16:L35)","v":0},null,null,null,null,null,{"$f":"IFERROR(SUM(R16:R35),0)","v":0},{"$f":"IFERROR(SUM(S16:S35),0)","v":0},{"$f":"SUM(T16:T35)","v":0},{"$f":"SUM(U16:U35)","v":0},{"$f":"S36-T36-U36","v":0},"check (a)"]
[]
[]
[]
[]
[]
[null,"Tickmark Explanation:"]