{"text_format":"1","workbook":"xlsx","n_sheets":14,"sheets":["Sign Off","A - Contractor Summary","A.1 SEE Members","B - Summary Expenses ","C.1 - Rate Sheets","C.2 - Timesheets - Labor","C.3 - Asset by Company","C.4 - Timesheets - Equipment","D - Lodging","E - Fuel","F - Meals","I - Other","G - Per Diem","H - Mileage"],"not_rendered":{"charts":0,"images":0,"macros":1,"external_links":3,"defined_names":9,"comments":0,"pivot_tables":0},"unopened":[],"bounds":{"document_bytes":16777216,"sheet_cells":100000,"rows_first":2000,"rows_last":500,"rows_between":2000,"halvings":0,"cell_chars":16384,"cell_head_chars":4096},"cells_cut":0,"cells_raw":0,"read":"whole","date_system":"1900"}

{"sheet":"Sign Off","index":0,"n_rows":19,"n_cols":5,"rows_kept":19,"cut":false,"hidden":false,"merged":[[1,1,1,4],[3,1,3,4],[10,1,10,4],[15,1,15,4]]}
[]
[null,"Sign Off's"]
[]
[null,"Accounting"]
[]
[null,null,"Name","Title","Date"]
[null,"Preparer","Belen Villalba","Temp Analyst","2020-01-06"]
[null,"Reviewer","William Adams","Financial Analysis Manager","2020-01-14"]
[null,"Approver","N/A","N/A","N/A"]
[]
[null,"Audit Services"]
[]
[null,null,"Name","Title","Date"]
[null,"Preparer"]
[]
{"$rows_left_out":5}
{"sheet":"A - Contractor Summary","index":1,"n_rows":95,"n_cols":10,"rows_kept":95,"cut":false,"hidden":false,"merged":[[1,1,1,3],[3,1,12,3],[22,6,26,6],[22,9,26,9]]}
[]
[null,"Contractor Summary"]
[]
[null,"Test Plan: (A) Using the drop down list, select the vendor.  (B) Ensure address agrees to invoice(s). (C) Enter the distance between vendor address to Plant City, FL.  (D) Determine if vendor is part of the SEE (see tab A.1 for listing). (E) Determine if other agreements exist.  (F) Using the drop down list, select the Incident Base that the vendor was initially assigned.  (G) If the contractor includes multiple crews with different timelines, utilize the '+' symbol at the top of columns 'H' and 'K' (if necessary) to unhide the vendor summary.  (H) Click the button to populate the second (and third, if necessary) set of tabs for documentation of those expenses.  (I) Complete steps (A) through (F)."]
[]
[]
[]
[]
[]
[]
[]
[]
[]
[null,null,null,null,null,"G",null,null,"G"]
[null,null,"Vendor #10",null,null,"Vendor #2",null,null,"Vendor #3"]
{"$rows_left_out":81}
{"sheet":"A.1 SEE Members","index":2,"n_rows":65,"n_cols":3,"rows_kept":65,"cut":false,"hidden":false,"merged":[]}
["RMAG","RESPONDING COMPANY","COMPANY NAME"]
["SEE"]
["SEE"]
["SEE"]
["SEE"]
["SEE"]
["SEE"]
["SEE"]
["SEE"]
["SEE"]
["SEE"]
["SEE"]
["SEE"]
["SEE"]
["SEE"]
{"$rows_left_out":51}
{"sheet":"B - Summary Expenses ","index":3,"n_rows":65,"n_cols":8,"rows_kept":65,"cut":false,"hidden":false,"merged":[[1,1,1,7],[3,1,6,7],[30,1,30,4],[31,1,31,4]]}
[]
[null,"Summary of Expenses"]
[]
[null,"Test Plan: (A) Calculate Total Amount Invoiced for each expense category. (B) Using SAP t-code FBL1N, list Vendor Invoices Paid.  (C) Ensure there are no differences between the Total Expense Amount and the Total Paid Amount. (D) Ensure there are no difference between Total Invoiced Amount and Total Expense Amount.  (E) If applicable, identify difference due to Foreign currency exchange rates.  "]
[]
[]
[]
[]
[null,null,"A"]
[null,null,"Total Invoiced","Total Calculated","Allowable","Reviewed - Allowed","Reviewed - Not Allowable","Not Allowable"]
[null,"Labor Expense Total",640197.82999999996,{"$f":"+'C.2 - Timesheets - Labor'!FA109","v":640197.84000000008},{"$f":"'C.2 - Timesheets - Labor'!FB109","v":640197.84000000008},{"$f":"'C.2 - Timesheets - Labor'!FE109","v":0},{"$f":"'C.2 - Timesheets - Labor'!FF109","v":0},{"$f":"D11-(E11+F11+G11)","v":0}]
[null,"Equipment Expense Total",266082.55,{"$f":"+'C.4 - Timesheets - Equipment'!AT106","v":266082.54999999993},{"$f":"'C.4 - Timesheets - Equipment'!AU106","v":266082.54999999993},{"$f":"'C.4 - Timesheets - Equipment'!AW106","v":0},{"$f":"'C.4 - Timesheets - Equipment'!AX106","v":0},0]
[null,"Lodging Expense Total",null,{"$f":"+'D - Lodging'!L32","v":0},null,{"$f":"'D - Lodging'!V32","v":0},{"$f":"'D - Lodging'!W32","v":0},0]
[null,"Fuel/Transport Expense Total",3371.23,{"$f":"+'E - Fuel'!J62","v":3371.2299999999991},{"$f":"'E - Fuel'!Q62","v":0},{"$f":"'E - Fuel'!S62","v":3371.2299999999991},{"$f":"'E - Fuel'!T62","v":0},0]
[null,"Meal Expense Total",828.95,{"$f":"+'F - Meals'!R18","v":828.95449999999994},{"$f":"+'F - Meals'!R18","v":828.95449999999994},{"$f":"'F - Meals'!T18","v":0},{"$f":"'F - Meals'!U18","v":0},0]
{"$rows_left_out":51}
{"sheet":"C.1 - Rate Sheets","index":4,"n_rows":55,"n_cols":19,"rows_kept":55,"cut":false,"hidden":false,"merged":[[12,1,12,5],[12,7,12,8],[3,1,3,8],[54,6,54,8],[1,1,1,8]]}
[]
[null,"Labor Charges - Rate Sheet"]
[]
[null,"Test Plan: (A) Using the vendor rate sheet, ensure that a rate was provided for all Positions and Equipment types.  "]
[]
[null,"Labor Types:"]
[null,"ST","Straight Time"]
[null,"OT","Over Time"]
[null,"DT","Double Time"]
[null,"MOB/DMOB","Mobilization/Demobilization Time"]
[]
[]
[null,"Labor per Man Hour",null,null,null,null," ","Labor per Equipment Hour"]
[null,"A",null,null,null,null,null,"A"]
[null,"POSITION","ST","OT","DT","MOB/DMOB",null,"Type","$/HOUR"]
{"$rows_left_out":41}
{"sheet":"C.2 - Timesheets - Labor","index":5,"n_rows":122,"n_cols":164,"rows_kept":122,"cut":false,"hidden":false,"merged":[[14,158,17,158],[15,154,17,154],[14,125,14,128],[14,129,14,132],[16,125,16,128],[16,129,16,132],[109,125,109,127],[109,129,109,131],[14,117,14,120],[14,121,14,124],[16,117,16,120],[16,121,16,124],[109,117,109,119],[109,121,109,123],[14,141,14,144],[16,141,16,144],[109,141,109,143],[14,145,14,148],[16,145,16,148],[109,145,109,147],[14,133,14,136],[14,137,14,140],[16,133,16,136],[16,137,16,140],[14,9,17,9],[14,13,14,16],[14,10,16,12],[14,149,14,152],[16,93,16,96],[109,101,109,103],[109,105,109,107],[14,109,14,112],[14,113,14,116],[16,109,16,112],[16,113,16,116],[109,109,109,111],[109,113,109,115],[109,133,109,135],[109,137,109,139],[109,45,109,47],[14,33,14,36],[14,37,14,40],[14,41,14,44],[14,45,14,48],[109,49,109,51],[109,53,109,55],[109,29,109,31],[109,33,109,35],[16,45,16,48],[16,49,16,52],[16,53,16,56],[3,2,7,12],[16,41,16,44],[109,37,109,39],[109,41,109,43],[16,21,16,24],[16,25,16,28],[109,21,109,23],[109,25,109,27],[16,29,16,32],[14,21,14,24],[14,25,14,28],[14,29,14,32],[109,13,109,15],[109,17,109,19],[108,1,108,5],[14,1,17,1],[14,2,17,2],[14,4,17,4],[14,5,17,5],[14,3,17,3],[14,17,14,20],[16,17,16,20],[14,7,17,7],[16,13,16,16],[1,1,1,162],[14,160,17,160],[14,161,17,161],[14,162,17,162],[15,152,17,152],[15,151,17,151],[15,150,17,150],[14,157,17,157],[14,159,17,159],[15,156,17,156],[15,155,17,155],[13,13,13,16],[14,6,17,6],[16,33,16,36],[14,8,17,8],[16,37,16,40],[14,49,14,52],[14,53,14,56],[14,57,14,60],[16,57,16,60],[16,61,16,64],[14,77,14,80],[16,77,16,80],[15,149,17,149],[109,57,109,59],[109,61,109,63],[14,65,14,68],[16,65,16,68],[14,61,14,64],[16,69,16,72],[109,65,109,67],[109,69,109,71],[14,73,14,76],[16,73,16,76],[109,73,109,75],[109,77,109,79],[14,69,14,72],[16,81,16,84],[16,85,16,88],[109,81,109,83],[109,85,109,87],[14,89,14,92],[16,89,16,92],[14,81,14,84],[14,85,14,88],[109,89,109,91],[109,93,109,95],[14,97,14,100],[16,97,16,100],[109,97,109,99],[14,93,14,96],[14,153,14,156],[109,150,109,151],[14,101,14,104],[14,105,14,108],[16,101,16,104],[16,105,16,108],[15,153,17,153]]}
[]
[null,"Labor Charges - Time Card"]
[]
[null,"Test Plan:","Obtain the time cards.  (A) Using the Asset by Company tab (C.3), populate the crew members names and positions (if provided).  Find additional information regarding individual crew member from related invoice.  (B) Enter hours worked from time card(s). (C) Confirm that the dates per the time cards fall between dates provided per 'A - Contractor Summary' tab. (D) Confirm the labor type charged agrees to the rate sheet. (E) Identify any labor charges to be reviewed (manually enter amounts based on reasonability of time period labor was charged, discrepancies between timecards and invoice, etc.  (F) For charges which required further review, document review (include why it was determined to be allowed/disallowed via a tickmark)."]
[]
[]
[]
[]
[]
[null,"Rx","Recalculated."]
[null,"a","Provided from tab 'C.1 - Rate Sheets'."]
[null,"b","Check figure should equal $0.  Cell will appear yellow if discrepancies are noted."]
[]
[null,null,"A ",null,null,null,null,"Rx",null,"C",null,null,null,null,null,null,null,null,null,null,null,null,null,null,null,null,null,null,null,null,null,null,null,null,null,null,null,null,null,null,null,null,null,null,null,null,null,null,null,null,null,null,null,null,null,null,null,null,null,null,null,null,null,null,null,null,null,null,null,null,null,null,null,null,null,null,null,null,null,null,null,null,null,null,null,null,null,null,null,null,null,null,null,null,null,null,null,null,null,null,null,null,null,null,null,null,null,null,null,null,null,null,null,null,null,null,null,null,null,null,null,null,null,null,null,null,null,null,null,null,null,null,null,null,null,null,null,null,null,null,null,null,null,null,null,null,null,null,null,null,null,null,null,null,null,null,null,"Rx",null,"E","F"]
[null,"#","Name","Position","Company","Crew#","Invoice#","Start Date","End Date","Dates Worked Reasonable?","RATES",null,null,"2018-10-11",null,null,null,"2018-10-12",null,null,null,"2018-10-13",null,null,null,"2018-10-14",null,null,null,"2018-10-15",null,null,null,"2018-10-16",null,null,null,"2018-10-17",null,null,null,"2018-10-18",null,null,null,"2018-10-19",null,null,null,"2018-10-20",null,null,null,"2018-10-21",null,null,null,"2018-10-22",null,null,null,"2018-10-23",null,null,null,"2018-10-24",null,null,null,"2018-10-25",null,null,null,"2018-10-26",null,null,null,"2018-10-27",null,null,null,"2018-10-28",null,null,null,"2018-10-29",null,null,null,"2018-10-30",null,null,null,"2018-10-31",null,null,null,"2018-11-04",null,null,null,"2018-11-05",null,null,null,"2018-11-06",null,null,null,"2018-11-07",null,null,null,"2018-11-08",null,null,null,"2018-11-09",null,null,null,"2018-11-10",null,null,null,"2018-11-11",null,null,null,"2018-11-12",null,null,null,"2018-11-13",null,null,null,"2018-11-14",null,null,null,"2018-11-15",null,null,null,"2018-11-16",null,null,null,"Total Labor Hours",null,null,null,"Total Labor $",null,null,null,"Allowable Charges","Labor Type Appropriate?","To Be Reviewed","Reviewed - Allowable Charge","Reviewed - Unallowable Charge","Tickmarks"]
{"$rows_left_out":108}
{"sheet":"C.3 - Asset by Company","index":6,"n_rows":1,"n_cols":3,"rows_kept":1,"cut":false,"hidden":false,"merged":[]}
["Asset Tag","Position","Name"]

{"sheet":"C.4 - Timesheets - Equipment","index":7,"n_rows":110,"n_cols":52,"rows_kept":110,"cut":false,"hidden":false,"merged":[[1,1,1,50],[14,48,16,48],[14,49,16,49],[14,50,16,50],[14,45,16,45],[14,47,16,47],[14,46,16,46],[3,2,8,9],[14,29,14,32],[14,33,14,39],[14,40,14,43],[105,1,105,5],[14,44,16,44],[14,10,16,10],[14,1,16,1],[14,2,16,2],[14,4,16,4],[14,5,16,5],[14,6,16,6],[14,9,16,9],[14,7,16,7],[14,8,16,8],[14,3,16,3],[14,11,14,14],[14,15,14,21],[14,22,14,28]]}
[]
[null,"Equipment Charges - Time Card"]
[]
[null,"Test Plan:","Obtain the time cards.  (A) Populate the equipment names and types (if provided). Find additional information regarding individual equipment charge from related invoice. (B) Enter hours worked from time card(s).   (C) Confirm that the dates per the time cards fall between dates provided per 'A - Contractor Summary' tab. (D) Identify any equipment charges to be reviewed.  (E) For charges which required further review, document review (include why it was determined to be allowed/disallowed via a tickmark)."]
[]
[]
[]
[]
[]
[null,"Rx","Recalculated."]
[null,"a","Provided from tab 'C.1 - Rate Sheets'."]
[null,"b","Check figure should equal $0.  Cell will appear yellow if discrepancies are noted."]
[]
[null,null,"A ",null,null,null,null,"Rx",null,"C","a","B",null,null,null,null,null,null,null,null,null,null,null,null,null,null,null,null,null,null,null,null,null,null,null,null,null,null,null,null,null,null,null,null,"Rx",null,null,"D","E"]
[null,"#","Equipment Name","Equipment ID","Company","Crew#","Invoice","Start Date","End Date","Dates Worked Reasonable?","Rates","Week Ending  10/14/18",null,null,null,"Week Ending 10/21/18",null,null,null,null,null,null,"Week Ending 10/28/18",null,null,null,null,null,null,"Week Ending 11/4/18",null,null,null,"Week Ending 11/11/18",null,null,null,null,null,null,"Week Ending 11/18/18",null,null,null,"Total Hours","Total Equipment $","Allowable Charges","To Be Reviewed","Reviewed - Allowable Charge","Reviewed - Unallowable Charge","Tickmarks"]
{"$rows_left_out":96}
{"sheet":"D - Lodging","index":8,"n_rows":39,"n_cols":25,"rows_kept":39,"cut":false,"hidden":false,"merged":[[1,1,1,23],[11,15,11,23],[11,1,11,14],[3,1,6,14]]}
[]
[null,"Lodging Charges"]
[]
[null,"Test Plan:  (A) Obtain support of individual charges. (B) Enter Yes/No if receipt is itemized (C) Enter Yes/No if proof of payment has been provided. (D) Ensure charges fall between the dates the vendor was mobilized and the date they arrived.  (E) Ensure charges are prior to the date the vendor arrived home or was released to another utility.  (F) Ensure the location of stay was reasonable (G) Determine the amount(s) to be reviewed, allowed and/or disallowed.  (H) For charges which required further review, document review (include why it was determined to be allowed/disallowed via a tickmark)."]
[]
[]
[]
[null,"Rx","Recalculated."]
[null,"a","Check figure should equal $0.  Cell will appear yellow if discrepancies are noted."]
[]
[null,null,"A",null,null,null,null,null,null,null,null,null,"Rx","B","C","D","E","F","G",null,null,"H"]
[null,"Support Reviewed",null,null,null,null,null,null,null,null,null,null,null,null,null,"Conclusion"]
[null,"#","Type of Support","Support Identifier","Crew","Company","Check In Date","Person","Hotel Name","Location","# of Nights","Total Invoice","$ / Night","Itemized Receipt","Proof of Payment","Reasonable based on Mobilization date(s)","Reasonable based on Demobilization date(s)","Location Reasonable","Conclusion","$ Allowable Charge","$ To Be Reviewed","Reviewed - Allowable $","Reviewed - Unallowable $","Tickmark"]
[null,1,null,null,null,null,null,null,null,null,null,null,{"$f":"L14/K14","v":{"$error":"#DIV/0!"}},null,null,{"$f":"IF(AND(G14>='A - Contractor Summary'!$C$36,G14<='A - Contractor Summary'!$C$38),\"Yes\",IF(G14<'A - Contractor Summary'!$C$36,\"No\",IF(G14>'A - Contractor Summary'!$C$39,\"\",\"\")))","v":"No"},{"$f":"IF(OR(P14=\"Yes\",P14=\"No\")*AND(G14<'A - Contractor Summary'!$C$39),\"\",IF(AND(G14>'A - Contractor Summary'!$C$39,G14<'A - Contractor Summary'!$C$42),\"Yes\",IF(G14>'A - Contractor Summary'!$C$42,\"No\",\"Needs Review\")))","v":""},null,{"$f":"IF(AND(R14=\"YES\",O14=\"Yes\",N14=\"Yes\")*OR(P14=\"Yes\",Q14=\"Yes\"),\"Yes\",IF(OR(N14=\"No\",O14=\"No\",P14=\"No\",Q14=\"No\",R14=\"No\"),\"No\",\"Needs Review\"))","v":"No"},{"$f":"IF(S14=\"Yes\",L14,0)","v":0},{"$f":"IF(S14=\"Needs Review\",L14,0)","v":0}]
[null,2,null,null,null,null,null,null,null,null,null,null,{"$error":"#DIV/0!"},null,null,{"$f":"IF(AND(G15>='A - Contractor Summary'!$C$36,G15<='A - Contractor Summary'!$C$38),\"Yes\",IF(G15<'A - Contractor Summary'!$C$36,\"No\",IF(G15>'A - Contractor Summary'!$C$39,\"\",\"\")))","v":"No"},{"$f":"IF(OR(P15=\"Yes\",P15=\"No\")*AND(G15<'A - Contractor Summary'!$C$39),\"\",IF(AND(G15>'A - Contractor Summary'!$C$39,G15<'A - Contractor Summary'!$C$42),\"Yes\",IF(G15>'A - Contractor Summary'!$C$42,\"No\",\"Needs Review\")))","v":""},null,"No",0,0]
{"$rows_left_out":25}
{"sheet":"E - Fuel","index":9,"n_rows":69,"n_cols":22,"rows_kept":69,"cut":false,"hidden":false,"merged":[[1,1,1,20],[3,1,6,11],[11,12,11,20],[11,1,11,11],[4,15,6,20]]}
[]
[null,"Fuel Charges"]
[]
[null,"Test Plan: (A) Obtain support of individual charges. (B) Enter Yes/No if receipt is itemized (C) Enter Yes/No if proof of payment has been provided. (D) Ensure charges fall between the dates the vendor was mobilized and the date they arrived.  (E) Ensure charges are prior to the date the vendor arrived home or was released to another utility.  (F) Ensure the location of charge was reasonable (G) Determine the amount(s) to be reviewed, allowed  and/or disallowed.  (H)  For charges which required further review, document review (include why it was determined to be allowed/disallowed via a tickmark)."]
[null,null,null,null,null,null,null,null,null,null,null,null,null,null,null,"No Fuel Charges"]
[]
[]
[]
[null,"a","Check figure should equal $0.  Cell will appear yellow if discrepancies are noted."]
[]
[null,null,"A",null,null,null,null,null,null,null,"B","C","D","E","F","G",null,null,"H"]
[null,"Support Reviewed",null,null,null,null,null,null,null,null,null,null,"Conclusions"]
[null,"#","Type of Support","Support Identifier","Company","Date","Person     (Inv#)","Name","Location","Total Charge","Itemized Receipt","Proof of Payment","Reasonable based on Mobilization date(s)","Reasonable based on Demobilization date(s)","Locations Reasonable","Conclusion","$ Allowable Charge","$ To Be Reviewed","Reviewed - Allowable Charge","Reviewed - Unallowable Charge","Tickmarks"]
[null,1,"Receipt",null,"Vendor No.10","2018-10-17","TLH-STORM-1031-SW18",null,"SC",34.549999999999997,null,null,{"$f":"IF(AND(F14>='A - Contractor Summary'!$C$36,F14<='A - Contractor Summary'!$C$38),\"Yes\",IF(F14<'A - Contractor Summary'!$C$36,\"No\",IF(F14>'A - Contractor Summary'!$C$39,\"\",\"\")))","v":"No"},{"$f":"IF(OR(M14=\"Yes\",M14=\"No\")*AND(F14<'A - Contractor Summary'!$C$39),\"\",IF(AND(F14>'A - Contractor Summary'!$C$39,F14<'A - Contractor Summary'!$C$42),\"Yes\",IF(F14>'A - Contractor Summary'!$C$42,\"No\",\"Needs Review\")))","v":""},null,{"$f":"IF(AND(O14=\"Yes\",K14=\"Yes\",L14=\"Yes\")*OR(N14=\"Yes\",M14=\"Yes\"),\"Yes\",IF(OR(K14=\"No\",M14=\"No\",N14=\"No\",O14=\"No\",L14=\"No\"),\"No\",\"Needs Review\"))","v":"No"},{"$f":"IF(P14=\"Yes\",J14,0)","v":0},{"$f":"IF(P14=\"Needs Review\",J14,0)","v":0},{"$f":"+J14","v":34.549999999999997},null,1]
[null,2,"Receipt",null,"Vendor No.10","2018-10-17","TLH-STORM-1031-SW18",null,"GA",60,null,null,{"$f":"IF(AND(F15>='A - Contractor Summary'!$C$36,F15<='A - Contractor Summary'!$C$38),\"Yes\",IF(F15<'A - Contractor Summary'!$C$36,\"No\",IF(F15>'A - Contractor Summary'!$C$39,\"\",\"\")))","v":"No"},{"$f":"IF(OR(M15=\"Yes\",M15=\"No\")*AND(F15<'A - Contractor Summary'!$C$39),\"\",IF(AND(F15>'A - Contractor Summary'!$C$39,F15<'A - Contractor Summary'!$C$42),\"Yes\",IF(F15>'A - Contractor Summary'!$C$42,\"No\",\"Needs Review\")))","v":""},null,{"$f":"IF(AND(O15=\"Yes\",K15=\"Yes\",L15=\"Yes\")*OR(N15=\"Yes\",M15=\"Yes\"),\"Yes\",IF(OR(K15=\"No\",M15=\"No\",N15=\"No\",O15=\"No\",L15=\"No\"),\"No\",\"Needs Review\"))","v":"No"},0,0,60,null,1]
{"$rows_left_out":55}
{"sheet":"F - Meals","index":10,"n_rows":29,"n_cols":23,"rows_kept":29,"cut":false,"hidden":false,"merged":[[11,13,11,21],[3,1,6,12],[1,1,1,21],[11,1,11,12]]}
[]
[null,"Meal Charges"]
[]
[null,"Test Plan: (A) Obtain support of individual charges.  (B) Enter Yes/No if receipt is itemized.  (C) Enter Yes/No if proof of payment has been provided.  (D) Ensure charges fall between the dates the vendor was mobilized and the date they arrived.  (E) Ensure charges are prior to the date the vendor arrived home or was released to another utility.  (F) Ensure the location of charge was reasonable (G) Determine the amount(s) to be reviewed, allowed and/or disallowed.  (H) For charges which required further review, document review and include why it was determined to be allowed/disallowed via a tickmark. "]
[]
[]
[]
[]
[null,"a","Check figure should equal $0.  Cell will appear yellow if discrepancies are noted."]
[]
[null,null,"A",null,null,null,null,null,null,null,null,"B","C","D","E","F","G",null,null,"H"]
[null,"Support Reviewed",null,null,null,null,null,null,null,null,null,null,null,"Conclusions"]
[null,"#","Type of Support","Support Identifier","Company","Crew","Date","Person"," Restaurant Name","Location","$ Total","Itemized Receipt","Proof of Payment","Reasonable based on Mobilization date(s)","Reasonable based on Demobilization date(s)","Locations Reasonable","Conclusion","$ Allowable Charge","$ To Be Reviewed","Reviewed - Allowable Charge","Reviewed - Unallowable Charge","Tickmarks"]
[null,1,"receipt","Support Identifier","Vendor No.10","Michael Thompson","2018-10-17",19,"Flamingo Grill Buffet","Kannapolis, NC",337.77,"Itemized Receipt","Proof of Payment","yes","yes","Yes","Conclusion",{"$f":"+K14","v":337.77},{"$f":"IF(Q14=\"Needs Review\",K14,0)","v":0}]
[null,2,"receipt","Support Identifier","Vendor No.10","Michael Thompson","2018-10-17",19,"Atlanta South 75","122 Truck Stop Way",328.39,"Itemized Receipt","Proof of Payment","yes","yes","Yes","Conclusion",{"$f":"+K15","v":328.39},0]
{"$rows_left_out":15}
{"sheet":"I - Other","index":11,"n_rows":21,"n_cols":23,"rows_kept":21,"cut":false,"hidden":false,"merged":[[12,13,12,21],[12,1,12,12],[3,1,7,12],[21,3,21,21]]}
[]
[null,"Other Charges"]
[]
[null,"Test Plan: (A) Obtain support of individual charges.   (B) Enter Yes/No if receipt is itemized.  (C) Enter Yes/No if proof of payment has been provided.  (D) Ensure charges fall between the dates the vendor was mobilized and the date they arrived.  (E) Ensure charges are prior to the date the vendor arrived home or was released to another utility.  (F) Ensure the expense type is reasonable (G) Determine the amount(s) to be reviewed, allowed and/or disallowed.   (H)  For charges which required further review, document review and include why it was determined to be allowed/disallowed via a tickmark."]
[]
[]
[]
[]
[null,"a","Check figure should equal $0.  Cell will appear yellow if discrepancies are noted."]
[]
[]
[null,null,"A",null,null,null,null,null,null,null,null,"B","C","D","E","F","G",null,null,"H"]
[null,"Support Reviewed",null,null,null,null,null,null,null,null,null,null,null,"Conclusions"]
[null,"#","Type of Support","Support Identifier","Company","Crew","Date","Person","Vendor Name","Location","$ Total","Itemized Receipt","Proof of Payment","Reasonable based on Mobilization date(s)","Reasonable based on Demobilization date(s)","Expense Type Appropriate","Conclusion","$ Allowable Charge","$ To Be Reviewed","Reviewed - Allowable Charge","Reviewed - Unallowable Charge","Tickmarks"]
[null,1,null,null,null,null,null,null,null,null,null,null,null,{"$f":"IF(AND(G15>='A - Contractor Summary'!$C$36,G15<='A - Contractor Summary'!$C$38),\"Yes\",IF(G15<'A - Contractor Summary'!$C$36,\"No\",IF(G15>'A - Contractor Summary'!$C$39,\"\",\"\")))","v":"No"},{"$f":"IF(OR(N15=\"Yes\",N15=\"No\")*AND(G15<'A - Contractor Summary'!$C$39),\"\",IF(AND(G15>'A - Contractor Summary'!$C$39,G15<'A - Contractor Summary'!$C$42),\"Yes\",IF(G15>'A - Contractor Summary'!$C$42,\"No\",\"Needs Review\")))","v":""},"Needs Reviewed",{"$f":"IF(AND(P15=\"YES\",L15=\"Yes\",M15=\"yes\")*OR(N15=\"Yes\",O15=\"Yes\"),\"Yes\",IF(OR(O15=\"No\",P15=\"No\",N15=\"No\",M15=\"No\"),\"No\",\"Needs Review\"))","v":"No"},{"$f":"IF(Q15=\"Yes\",K15,0)","v":0},{"$f":"IF(Q15=\"Needs Review\",K15,0)","v":0}]
{"$rows_left_out":7}
{"sheet":"G - Per Diem","index":12,"n_rows":37,"n_cols":19,"rows_kept":37,"cut":false,"hidden":false,"merged":[[3,1,8,9],[1,1,1,17],[14,9,14,17],[14,1,14,8],[4,11,6,16]]}
[null,null,null,null,null,null,null," "]
[null,"Per Diem Charges"]
[]
[null,"Test Plan: (A) Enter per diem charges per invoice. (B) Enter number of crew worked per timecard.  (C) Enter the Per Diem Rate charged per person per meal (D) Ensure the number of crew members being charged is appropriate (This is comparing the submitted timecards and the per diem charges invoiced).  (E) Ensure charges fall between the dates the vendor was mobilized and the date they arrived.  (F) Ensure charges are prior to the date the vendor arrived home or was released to another utility.  (G)  Determine the amount(s) to be reviewed, allowed and/or disallowed.   (H) For charges which required further review, document review and include why it was determined to be allowed/disallowed via a tickmark."]
[]
[]
[]
[]
[]
[null,"Rx","Recalculated."]
[null,"a","Check figure should equal $0.  Cell will appear yellow if discrepancies are noted."]
[]
[]
[null,"A",null,null,null,"B","Rx","C","Rx","D","E","F","G",null,null,"H"]
[null,"Support Reviewed",null,null,null,null,null,null,null,"Conclusion"]
{"$rows_left_out":23}
{"sheet":"H - Mileage","index":13,"n_rows":42,"n_cols":23,"rows_kept":42,"cut":false,"hidden":false,"merged":[[1,1,1,21],[13,1,13,11],[13,12,13,21],[3,1,7,11],[5,14,7,19]]}
[]
[null,"Mileage Charges"]
[]
[null,"Test Plan: (A) Obtain support of individual mileage charged (Typically a rate and mileage included on invoice).  (B) Ensure charges fall between the dates the vendor was mobilized and the date they arrived.  (C) Ensure charges are prior to the date the vendor arrived home or was released to another utility.  (D)  Ensure number of miles charged deemed reasonable based on vendor location (recalculated per 'A - Contractor Summary' tab).  (E) Ensure the location of charge was reasonable (If mobilizing, charges should be related to travelling to TECO Service area, and home, if demobilizing).  (F) Determine the amount(s) to be reviewed, allowed and/or disallowed.  (G) For charges which required further review, document review and include why it was determined to be allowed/disallowed via a tickmark."]
[]
[]
[]
[]
[]
[null,"Rx","Recalculated."]
[null,"a","Check figure should equal $0.  Cell will appear yellow if discrepancies are noted."]
[]
[null,null,"A",null,null,null,null,null,null,null,null,"Rx","B","C","D","E","F",null,null,"G"]
[null,"Support Reviewed",null,null,null,null,null,null,null,null,null,null,"Conclusions"]
[null,"#","Type of Support","Company","Equipment Name","Equipment ID","Crew","Date","Location","Miles Charged","$ / Mile (Rate)","Total Charge","Reasonable based on Mobilization date(s)","Reasonable based on Demobilization date(s)","Number of Miles Charged Reasonable","Locations Reasonable","Conclusion","$ Allowable Charge","$ To Be Reviewed","Reviewed - Allowable Charge","Reviewed - Unallowable Charge","Tickmarks"]
{"$rows_left_out":27}